BDBM367372 (6RS)-6-[(Ethylsulfanyl)methyl]-3-(phenylamino)-2-(pyridin-4-yl)-1,5,6,7-tetrahydro-4H-indol-4-one::US10227299, Example 63
SMILES CCSCC1Cc2[nH]c(c(Nc3ccccc3)c2C(=O)C1)-c1ccncc1
InChI Key
Data  1 IC50
  Tab Delimited (TSV)   2D SDfile   Computed 3D by Vconf -m prep SDfile
Find this compound or compounds like it in BindingDB:
Activity Spreadsheet -- Enzyme Inhibition Constant Data from BindingDB
Found 1 hit for monomerid = 367372
TargetMitotic checkpoint serine/threonine-protein kinase BUB1(Homo sapiens (Human))
Bayer Pharma Aktiengesellschaft
US Patent
LigandPNGBDBM367372((6RS)-6-[(Ethylsulfanyl)methyl]-3-(phenylamino)-2-...)
Affinity DataIC50:  4nM. Assay description: Bub1-inhibitory activities of compounds described in the present invention were quantified using a time-resolved fluorescence energy transfer (TR-FRE...
Ligand InfoPC cidPC sid
In DepthDetails US Patent