BDBM368257 US10227338, Example 39::US10227338, Example 49
SMILES CNC1CCN(C1)c1ccccc1Nc1ccc(c(F)c1)S(=O)(=O)Nc1cscn1
InChI Key InChIKey=SKJKCRCCBVXTNB-UHFFFAOYSA-N
Data  3 IC50
  Tab Delimited (TSV)   2D SDfile   Computed 3D by Vconf -m prep SDfile
Find this compound or compounds like it in BindingDB:
Activity Spreadsheet -- Enzyme Inhibition Constant Data from BindingDB
Found 3 hits for monomerid = 368257
TargetSodium channel protein type 9 subunit alpha(Homo sapiens (Human))
Daewoong Pharmaceutical
US Patent
LigandPNGBDBM368257(US10227338, Example 39 | US10227338, Example 49)
Affinity DataIC50:  53nM. Assay description: In order to measure the sodium ion channel blocking effect, an IonFlux16 Auto patch clamp system (Fluxion, Inc.) and a plate for exclusive use were u...
Ligand InfoPC cidPC sid
In DepthDetails US Patent
TargetSodium channel protein type 5 subunit alpha(Homo sapiens (Human))
Daewoong Pharmaceutical
US Patent
LigandPNGBDBM368257(US10227338, Example 39 | US10227338, Example 49)
Affinity DataIC50: >1.00E+4nM. Assay description: In order to measure the sodium ion channel blocking effect, an IonFlux16 Auto patch clamp system (Fluxion, Inc.) and a plate for exclusive use were u...
Ligand InfoPC cidPC sid
In DepthDetails US Patent
TargetSodium channel protein type 9 subunit alpha(Homo sapiens (Human))
Daewoong Pharmaceutical
US Patent
LigandPNGBDBM368257(US10227338, Example 39 | US10227338, Example 49)
Affinity DataIC50:  609nM. Assay description: In order to measure the sodium ion channel blocking effect, an IonFlux16 Auto patch clamp system (Fluxion, Inc.) and a plate for exclusive use were u...
Ligand InfoPC cidPC sid
In DepthDetails US Patent