BDBM370405 US10233189, Example 59::US10787457, Example 59::US11014930, Example 59::US11236096, Example 59
SMILES Cc1cc(NC(=O)c2cn(c3ncnc(N)c23)C2(C)CCCC2)n[nH]1
InChI Key InChIKey=FNPPWEHZKNTQMD-UHFFFAOYSA-N
Data  4 IC50
  Tab Delimited (TSV)   2D SDfile   Computed 3D by Vconf -m prep SDfile
Find this compound or compounds like it in BindingDB:
Activity Spreadsheet -- Enzyme Inhibition Constant Data from BindingDB
Found 4 hits for monomerid = 370405
TargetProto-oncogene tyrosine-protein kinase receptor Ret(Homo sapiens (Human))
Taiho Pharmaceutical
US Patent
LigandPNGBDBM370405(US10233189, Example 59 | US10787457, Example 59 | ...)
Affinity DataIC50:  0.510nM. Assay description: To measure the inhibitory activity, first, the compounds of the present invention were individually diluted with dimethyl sulfoxide (DMSO) stepwise. ...
Ligand InfoPC cidPC sid
In DepthDetails US Patent
TargetProto-oncogene tyrosine-protein kinase receptor Ret(Homo sapiens (Human))
Taiho Pharmaceutical
US Patent
LigandPNGBDBM370405(US10233189, Example 59 | US10787457, Example 59 | ...)
Affinity DataIC50:  0.510nM. Assay description: Regarding the conditions for measurement of in vitro inhibitory activity of compounds against RET kinase activity, the website of AnaSpec states that...
Ligand InfoPC cidPC sid
In DepthDetails US Patent
TargetProto-oncogene tyrosine-protein kinase receptor Ret(Homo sapiens (Human))
Taiho Pharmaceutical
US Patent
LigandPNGBDBM370405(US10233189, Example 59 | US10787457, Example 59 | ...)
Affinity DataIC50:  0.510nM. Assay description: To measure the inhibitory activity, first, the compounds of the present invention were individually diluted with dimethyl sulfoxide (DMSO) stepwise. ...
Ligand InfoPC cidPC sid
In DepthDetails US Patent
TargetProto-oncogene tyrosine-protein kinase receptor Ret(Homo sapiens (Human))
Taiho Pharmaceutical
US Patent
LigandPNGBDBM370405(US10233189, Example 59 | US10787457, Example 59 | ...)
Affinity DataIC50:  0.510nM. Assay description: To measure the inhibitory activity, first, the compounds of the present invention were individually diluted with dimethyl sulfoxide (DMSO) stepwise. ...
Ligand InfoPC cidPC sid
In DepthDetails US Patent