BDBM371454 N-[1-(Fluoromethyl)cyclopropyl]-3-[(1-methylpyrazol-4-yl)methyl]-2,4-dioxo-1-(thiazol-5-ylmethyl)quinazoline-6-sulfonamide::US10239843, Example 563
SMILES Cn1cc(Cn2c(=O)n(Cc3cncs3)c3ccc(cc3c2=O)S(=O)(=O)NC2(CF)CC2)cn1
InChI Key InChIKey=RWKBTOHAKQNMAQ-UHFFFAOYSA-N
Data  1 IC50
  Tab Delimited (TSV)   2D SDfile   Computed 3D by Vconf -m prep SDfile
Find this compound or compounds like it in BindingDB:
Activity Spreadsheet -- Enzyme Inhibition Constant Data from BindingDB
Found 1 hit for monomerid = 371454
TargetPoly(ADP-ribose) glycohydrolase(Homo sapiens (Human))
Cancer Research Technology
US Patent
LigandPNGBDBM371454(N-[1-(Fluoromethyl)cyclopropyl]-3-[(1-methylpyrazo...)
Affinity DataIC50:  8nM. Assay description: PARG In vitro assays were conducted in a total volume of 15 ul in a standard 384 well format. 5 ul of Human Full Length PARG (Produced internally by ...
Ligand InfoPC cidPC sid
In DepthDetails US Patent