BDBM371506 1-[(2,4-Dimethylthiazol-5-yl)methyl]-N-[1-(fluoromethyl)cyclopropyl]-3-[(3-methylisoxazol-5-yl)methyl]-2,4-dioxo-quinazoline-6-sulfonamide::US10239843, Example 616
SMILES Cc1cc(Cn2c(=O)n(Cc3sc(C)nc3C)c3ccc(cc3c2=O)S(=O)(=O)NC2(CF)CC2)on1
InChI Key InChIKey=YESKKJQPTMFXIK-UHFFFAOYSA-N
Data  2 IC50
  Tab Delimited (TSV)   2D SDfile   Computed 3D by Vconf -m prep SDfile
Find this compound or compounds like it in BindingDB:
Activity Spreadsheet -- Enzyme Inhibition Constant Data from BindingDB
Found 2 hits for monomerid = 371506
TargetADP-ribosylhydrolase ARH3(Homo sapiens (Human))
Cancer Research Technology
US Patent
LigandPNGBDBM371506(1-[(2,4-Dimethylthiazol-5-yl)methyl]-N-[1-(fluorom...)
Affinity DataIC50: >1.50E+5nM. Assay description: ARH3 In vitro selectivity assays were conducted in a total volume of 15 ul in a standard 384 well format. 5 ul of Human Full Length ARH3 (Enzo Life S...
Ligand InfoPC cidPC sid
In DepthDetails US Patent
TargetPoly(ADP-ribose) glycohydrolase(Homo sapiens (Human))
Cancer Research Technology
US Patent
LigandPNGBDBM371506(1-[(2,4-Dimethylthiazol-5-yl)methyl]-N-[1-(fluorom...)
Affinity DataIC50:  17nM. Assay description: PARG In vitro assays were conducted in a total volume of 15 ul in a standard 384 well format. 5 ul of Human Full Length PARG (Produced internally by ...
Ligand InfoPC cidPC sid
In DepthDetails US Patent