BDBM377 (2R,3R)-2-ethyl-1,1-dioxo--thiolan-3-yl N-[(2S,3R)-4-[(4aS,8aS)-3-(tert-butylcarbamoyl)-decahydroisoquinolin-2-yl]-3-hydroxy-1-phenylbutan-2-yl]carbamate::Sulfone Deriv. 10
SMILES [H][C@@]12CCCC[C@]1([H])CN(C[C@@H](O)[C@H](Cc1ccccc1)NC(=O)O[C@@H]1CCS(=O)(=O)[C@@H]1CC)C(C2)C(=O)NC(C)(C)C
InChI Key InChIKey=DQMCOXURPZMVFV-SCNOPYMHSA-N
Data  1 IC50
  Tab Delimited (TSV)   2D SDfile   Computed 3D by Vconf -m prep SDfile
Find this compound or compounds like it in BindingDB:
Activity Spreadsheet -- Enzyme Inhibition Constant Data from BindingDB
Found 1 hit for monomerid = 377
TargetDimer of Gag-Pol polyprotein [489-587](Human immunodeficiency virus type 1)
Merck Research Laboratories
LigandPNGBDBM377((2R,3R)-2-ethyl-1,1-dioxo--thiolan-3-yl N-[(2S,3R)...)
Affinity DataIC50:  13.1nMpH: 5.5 T: 2°C. Assay description: Sensitivity of HIV-1 protease activity to protease inhibitors was determined by a peptide substrate cleavage assay. Protease products were analyzed o...
In DepthDetails ArticlePubMed