BDBM392114 US10301272, Example 9/6
SMILES CC(C)(C)NC(=O)c1cc(cc(c1)C1(C)CC1)-c1sc(nc1CC1CCCCC1)C(=O)N[C@H]1C[C@@H](C1)C(O)=O
InChI Key InChIKey=VTRHQLPYGVWKKI-AFARHQOCSA-N
Data  5 IC50  2 Kd  1 EC50
  Tab Delimited (TSV)   2D SDfile   Computed 3D by Vconf -m prep SDfile
Find this compound or compounds like it in BindingDB:
Activity Spreadsheet -- Enzyme Inhibition Constant Data from BindingDB
Found 8 hits for monomerid = 392114
TargetIsoform 2 of Nuclear receptor ROR-gamma (RORgT)(Homo sapiens (Human))
Phenex Pharmaceuticals
US Patent
LigandPNGBDBM392114(US10301272, Example 9/6)
Affinity DataIC50:  794nM. Assay description: Determination of a ligand mediated Gal4 promoter driven transactivation to quantify ligand binding to RORγ was performed as follows: DNA encodin...
Ligand InfoPC cidPC sid
In DepthDetails US Patent
TargetIsoform 2 of Nuclear receptor ROR-gamma (RORgT)(Homo sapiens (Human))
Phenex Pharmaceuticals
US Patent
LigandPNGBDBM392114(US10301272, Example 9/6)
Affinity DataIC50:  31.6nM. Assay description: Cells were incubated for additional 16 h before firefly (FF) luciferase activities were measured sequentially in the same cell extract using a Dual-L...
Ligand InfoPC cidPC sid
In DepthDetails US Patent
TargetIsoform 2 of Nuclear receptor ROR-gamma (RORgT)(Homo sapiens (Human))
Phenex Pharmaceuticals
US Patent
LigandPNGBDBM392114(US10301272, Example 9/6)
Affinity DataIC50:  31.6nM. Assay description: Cells were incubated for additional 16 h before renilla (REN) luciferase activities were measured sequentially in the same cell extract using a Dual-...
Ligand InfoPC cidPC sid
In DepthDetails US Patent
TargetNuclear receptor ROR-beta(Homo sapiens (Human))
Phenex Pharmaceuticals
Curated by ChEMBL
LigandPNGBDBM392114(US10301272, Example 9/6)
Affinity DataKd:  18nM. Assay description: Binding affinity to recombinant human RORbeta LBD (201 to 452 residues) expressed in Escherichia coli BL21 (DE3) GOLD by 1,8-ANS dye-based thermofluo...
Ligand InfoPC cidPC sid
In DepthDetails ArticlePubMed
TargetNuclear receptor ROR-beta(Homo sapiens (Human))
Phenex Pharmaceuticals
Curated by ChEMBL
LigandPNGBDBM392114(US10301272, Example 9/6)
Affinity DataIC50:  115nM. Assay description: Binding affinity to recombinant human RORbeta LBD (201 to 452 residues) expressed in Escherichia coli BL21 (DE3) GOLD by 1,8-ANS dye-based thermofluo...
Ligand InfoPC cidPC sid
In DepthDetails ArticlePubMed
TargetNuclear receptor ROR-gamma(Homo sapiens (Human))
Phenex Pharmaceuticals
Curated by ChEMBL
LigandPNGBDBM392114(US10301272, Example 9/6)
Affinity DataIC50:  33nM. Assay description: Inverse agonist activity at human GAL4 DBD-fused RORgammat LBD (237 to 497 residues) expressed in HEK293T cells assessed as reduction in ROR mediated...
Ligand InfoPC cidPC sid
In DepthDetails ArticlePubMed
TargetNuclear receptor ROR-gamma(Homo sapiens (Human))
Phenex Pharmaceuticals
Curated by ChEMBL
LigandPNGBDBM392114(US10301272, Example 9/6)
Affinity DataEC50:  2.40E+3nM. Assay description: Inverse agonist activity at RORgammat in human whole blood assessed as reduction in IL17A production
Ligand InfoPC cidPC sid
In DepthDetails ArticlePubMed
TargetNuclear receptor ROR-gamma(Homo sapiens (Human))
Phenex Pharmaceuticals
Curated by ChEMBL
LigandPNGBDBM392114(US10301272, Example 9/6)
Affinity DataKd:  4.80nM. Assay description: Binding affinity to recombinant human RORgamma LBD (237 to 497 residues) expressed in Escherichia coli BL21 (DE3) GOLD by 1,8-ANS dye-based thermoflu...
Ligand InfoPC cidPC sid
In DepthDetails ArticlePubMed