BDBM39915 2-[(5-chloro-2-hydroxy-anilino)methylene]-5-(2-furyl)cyclohexane-1,3-quinone::2-[(5-chloro-2-hydroxyanilino)methylidene]-5-(2-furanyl)cyclohexane-1,3-dione::2-[(5-chloro-2-hydroxyanilino)methylidene]-5-(furan-2-yl)cyclohexane-1,3-dione::2-[[(5-chloranyl-2-oxidanyl-phenyl)amino]methylidene]-5-(furan-2-yl)cyclohexane-1,3-dione::MLS000037985::SMR000039816::cid_658836
SMILES Oc1ccc(Cl)cc1NC=C1C(=O)CC(CC1=O)c1ccco1
InChI Key InChIKey=UWMOPJNWVWAJCK-XFXZXTDPSA-N
Data  2 IC50
  Tab Delimited (TSV)   2D SDfile   Computed 3D by Vconf -m prep SDfile
Find this compound or compounds like it in BindingDB:
Activity Spreadsheet -- Enzyme Inhibition Constant Data from BindingDB
Found 2 hits for monomerid = 39915
TargetM1 family aminopeptidase(Plasmodium falciparum (isolate FcB1 / Columbia))
Srmlsc
Curated by PubChem BioAssay
LigandPNGBDBM39915(2-[(5-chloro-2-hydroxy-anilino)methylene]-5-(2-fur...)
Affinity DataIC50:  5.58E+3nM. Assay description: Southern Research Molecular Libraries Screening Center (SRMLSC) Southern Research Institute (Birmingham, Alabama) NIH Molecular Libraries Screening...
In DepthDetails PCBioAssay
TargetEstrogen receptor(Homo sapiens (Human))
Emory University
Curated by PubChem BioAssay
LigandPNGBDBM39915(2-[(5-chloro-2-hydroxy-anilino)methylene]-5-(2-fur...)
Affinity DataIC50:  4.38E+4nM. Assay description: NIH Molecular Libraries Screening Centers Network [MLSCN] Emory Chemical Biology Discovery Center in MLSCN Assay provider: John A. Katzenellenbogen, ...
In DepthDetails PCBioAssay