BDBM399275 US10323029, Generic formula 52580 IB::US11034691, CYM generic formula 52580 IB
SMILES Clc1ccc(cc1Cl)[C@H](NC(=O)c1ccc(C#N)c(Cl)c1)c1ccc(Br)cn1
InChI Key InChIKey=JWFPFBZCDCVFBO-IBGZPJMESA-N
Data  8 IC50
  Tab Delimited (TSV)   2D SDfile   Computed 3D by Vconf -m prep SDfile
Find this compound or compounds like it in BindingDB:
Activity Spreadsheet -- Enzyme Inhibition Constant Data from BindingDB
Found 8 hits for monomerid = 399275
TargetSphingosine 1-phosphate receptor 1(Homo sapiens (Human))
The Scripps Research Institute
US Patent
LigandPNGBDBM399275(US10323029, Generic formula 52580 IB | US11034691,...)
Affinity DataIC50:  141nM. Assay description: TBD
Ligand InfoPC cidPC sid
In DepthDetails US Patent
TargetSphingosine 1-phosphate receptor 2(Homo sapiens (Human))
The Scripps Research Institute
US Patent
LigandPNGBDBM399275(US10323029, Generic formula 52580 IB | US11034691,...)
Affinity DataIC50: >5.00E+4nM. Assay description: TBD
Ligand InfoPC cidPC sid
In DepthDetails US Patent
TargetSphingosine 1-phosphate receptor 3(Homo sapiens (Human))
The Scripps Research Institute
US Patent
LigandPNGBDBM399275(US10323029, Generic formula 52580 IB | US11034691,...)
Affinity DataIC50:  7nM. Assay description: TBD
Ligand InfoPC cidPC sid
In DepthDetails US Patent
TargetSphingosine 1-phosphate receptor 4(Homo sapiens (Human))
The Scripps Research Institute
US Patent
LigandPNGBDBM399275(US10323029, Generic formula 52580 IB | US11034691,...)
Affinity DataIC50:  2.48E+4nM. Assay description: Ligand competition binding was used.
Ligand InfoPC cidPC sid
In DepthDetails US Patent
TargetSphingosine 1-phosphate receptor 1(Homo sapiens (Human))
The Scripps Research Institute
US Patent
LigandPNGBDBM399275(US10323029, Generic formula 52580 IB | US11034691,...)
Affinity DataIC50:  141nM. Assay description: Ligand competition binding was used.
Ligand InfoPC cidPC sid
In DepthDetails US Patent
TargetSphingosine 1-phosphate receptor 2(Homo sapiens (Human))
The Scripps Research Institute
US Patent
LigandPNGBDBM399275(US10323029, Generic formula 52580 IB | US11034691,...)
Affinity DataIC50: >5.00E+4nM. Assay description: Ligand competition binding was used.
Ligand InfoPC cidPC sid
In DepthDetails US Patent
TargetSphingosine 1-phosphate receptor 3(Homo sapiens (Human))
The Scripps Research Institute
US Patent
LigandPNGBDBM399275(US10323029, Generic formula 52580 IB | US11034691,...)
Affinity DataIC50:  7nM. Assay description: Ligand competition binding was used.
Ligand InfoPC cidPC sid
In DepthDetails US Patent
TargetSphingosine 1-phosphate receptor 4(Homo sapiens (Human))
The Scripps Research Institute
US Patent
LigandPNGBDBM399275(US10323029, Generic formula 52580 IB | US11034691,...)
Affinity DataIC50:  2.48E+4nM. Assay description: TBD
Ligand InfoPC cidPC sid
In DepthDetails US Patent