BDBM399354 US10323029, Generic formula 52670 IB::US11034691, CYM generic formula 52670 IB
SMILES Cc1cc(ccc1C#N)C(=O)N[C@@H](c1ccc(Cl)c(F)c1)c1ccc(Br)cn1
InChI Key InChIKey=IWEBRWJRUHNDER-FQEVSTJZSA-N
Data  4 IC50
  Tab Delimited (TSV)   2D SDfile   Computed 3D by Vconf -m prep SDfile
Find this compound or compounds like it in BindingDB:
Activity Spreadsheet -- Enzyme Inhibition Constant Data from BindingDB
Found 4 hits for monomerid = 399354
TargetSphingosine 1-phosphate receptor 1(Homo sapiens (Human))
The Scripps Research Institute
US Patent
LigandPNGBDBM399354(US10323029, Generic formula 52670 IB | US11034691,...)
Affinity DataIC50:  452nM. Assay description: TBD
Ligand InfoPC cidPC sid
In DepthDetails US Patent
TargetSphingosine 1-phosphate receptor 3(Homo sapiens (Human))
The Scripps Research Institute
US Patent
LigandPNGBDBM399354(US10323029, Generic formula 52670 IB | US11034691,...)
Affinity DataIC50:  11nM. Assay description: Ligand competition binding was used.
Ligand InfoPC cidPC sid
In DepthDetails US Patent
TargetSphingosine 1-phosphate receptor 1(Homo sapiens (Human))
The Scripps Research Institute
US Patent
LigandPNGBDBM399354(US10323029, Generic formula 52670 IB | US11034691,...)
Affinity DataIC50:  452nM. Assay description: Ligand competition binding was used.
Ligand InfoPC cidPC sid
In DepthDetails US Patent
TargetSphingosine 1-phosphate receptor 3(Homo sapiens (Human))
The Scripps Research Institute
US Patent
LigandPNGBDBM399354(US10323029, Generic formula 52670 IB | US11034691,...)
Affinity DataIC50:  11nM. Assay description: TBD
Ligand InfoPC cidPC sid
In DepthDetails US Patent