BDBM399361 US10323029, Generic formula 52677 IB::US11034691, CYM generic formula 52677 IB
SMILES Cc1cc(ccc1C#N)C(=O)N[C@@H](c1ccc(Cl)c(F)c1)c1ncc(Cl)cc1C
InChI Key InChIKey=ZXKVNTFFHSRCQM-NRFANRHFSA-N
Data  4 IC50
  Tab Delimited (TSV)   2D SDfile   Computed 3D by Vconf -m prep SDfile
Find this compound or compounds like it in BindingDB:
Activity Spreadsheet -- Enzyme Inhibition Constant Data from BindingDB
Found 4 hits for monomerid = 399361
TargetSphingosine 1-phosphate receptor 1(Homo sapiens (Human))
The Scripps Research Institute
US Patent
LigandPNGBDBM399361(US10323029, Generic formula 52677 IB | US11034691,...)
Affinity DataIC50:  621nM. Assay description: TBD
Ligand InfoPC cidPC sid
In DepthDetails US Patent
TargetSphingosine 1-phosphate receptor 3(Homo sapiens (Human))
The Scripps Research Institute
US Patent
LigandPNGBDBM399361(US10323029, Generic formula 52677 IB | US11034691,...)
Affinity DataIC50:  33nM. Assay description: Ligand competition binding was used.
Ligand InfoPC cidPC sid
In DepthDetails US Patent
TargetSphingosine 1-phosphate receptor 1(Homo sapiens (Human))
The Scripps Research Institute
US Patent
LigandPNGBDBM399361(US10323029, Generic formula 52677 IB | US11034691,...)
Affinity DataIC50:  621nM. Assay description: Ligand competition binding was used.
Ligand InfoPC cidPC sid
In DepthDetails US Patent
TargetSphingosine 1-phosphate receptor 3(Homo sapiens (Human))
The Scripps Research Institute
US Patent
LigandPNGBDBM399361(US10323029, Generic formula 52677 IB | US11034691,...)
Affinity DataIC50:  33nM. Assay description: TBD
Ligand InfoPC cidPC sid
In DepthDetails US Patent