BDBM399395 US10323029, Generic formula 52716 IB::US11034691, CYM generic formula 52716 IB
SMILES Fc1cc(ccc1Cl)[C@H](NC(=O)c1ccc(C#N)c(c1)C#N)c1ncc(Cl)cc1F
InChI Key InChIKey=QEQDYKXCRPIRTN-IBGZPJMESA-N
Data  4 IC50
  Tab Delimited (TSV)   2D SDfile   Computed 3D by Vconf -m prep SDfile
Find this compound or compounds like it in BindingDB:
Activity Spreadsheet -- Enzyme Inhibition Constant Data from BindingDB
Found 4 hits for monomerid = 399395
TargetSphingosine 1-phosphate receptor 1(Homo sapiens (Human))
The Scripps Research Institute
US Patent
LigandPNGBDBM399395(US10323029, Generic formula 52716 IB | US11034691,...)
Affinity DataIC50:  210nM. Assay description: TBD
Ligand InfoPC cidPC sid
In DepthDetails US Patent
TargetSphingosine 1-phosphate receptor 3(Homo sapiens (Human))
The Scripps Research Institute
US Patent
LigandPNGBDBM399395(US10323029, Generic formula 52716 IB | US11034691,...)
Affinity DataIC50:  18nM. Assay description: Ligand competition binding was used.
Ligand InfoPC cidPC sid
In DepthDetails US Patent
TargetSphingosine 1-phosphate receptor 1(Homo sapiens (Human))
The Scripps Research Institute
US Patent
LigandPNGBDBM399395(US10323029, Generic formula 52716 IB | US11034691,...)
Affinity DataIC50:  210nM. Assay description: Ligand competition binding was used.
Ligand InfoPC cidPC sid
In DepthDetails US Patent
TargetSphingosine 1-phosphate receptor 3(Homo sapiens (Human))
The Scripps Research Institute
US Patent
LigandPNGBDBM399395(US10323029, Generic formula 52716 IB | US11034691,...)
Affinity DataIC50:  18nM. Assay description: TBD
Ligand InfoPC cidPC sid
In DepthDetails US Patent