BDBM404438 (3aR,6aR)-5-cyano-N-(2-fluoro-4-(trifluoromethyl)phenyl)hexahydropyrrolo[3, 4-b]pyrrole-1(2H)-carboxamide::US10343992, Example 90::US10689345, Example 90::US11053198, Example 90::US11066365, Example 90::US11390584, Example 90
SMILES Fc1cc(ccc1NC(=O)N1CC[C@@H]2CN(C[C@H]12)C#N)C(F)(F)F
InChI Key InChIKey=NKSQYNVJOYRSIC-RNCFNFMXSA-N
Data  5 IC50
  Tab Delimited (TSV)   2D SDfile   Computed 3D by Vconf -m prep SDfile
Find this compound or compounds like it in BindingDB:
Activity Spreadsheet -- Enzyme Inhibition Constant Data from BindingDB
Found 5 hits for monomerid = 404438
TargetUbiquitin carboxyl-terminal hydrolase 30(Homo sapiens (Human))
Missions Therapeutics
US Patent
LigandPNGBDBM404438((3aR,6aR)-5-cyano-N-(2-fluoro-4-(trifluoromethyl)p...)
Affinity DataIC50: <100nM. Assay description: Dilution plates were prepared at 21 times the final concentration (2100 μM for a final concentration of 100 μM) in 50% DMSO in a 96-well po...
Ligand InfoPC cidPC sid
In DepthDetails US Patent
TargetUbiquitin carboxyl-terminal hydrolase 30(Homo sapiens (Human))
Missions Therapeutics
US Patent
LigandPNGBDBM404438((3aR,6aR)-5-cyano-N-(2-fluoro-4-(trifluoromethyl)p...)
Affinity DataIC50: <100nM. Assay description: USP30 Biochemical Fluorescence Intensity Kinetic Assay.Reactions were performed in duplicate in black 384 well plates (small volume, Greiner 784076) ...
Ligand InfoPC cidPC sid
In DepthDetails US Patent
TargetUbiquitin carboxyl-terminal hydrolase 30(Homo sapiens (Human))
Missions Therapeutics
US Patent
LigandPNGBDBM404438((3aR,6aR)-5-cyano-N-(2-fluoro-4-(trifluoromethyl)p...)
Affinity DataIC50: <100nM. Assay description: Dilution plates were prepared at 21 times the final concentration (2100 μM for a final concentration of 100 μM) in 50% DMSO in a 96-well po...
Ligand InfoPC cidPC sid
In DepthDetails US Patent
TargetUbiquitin carboxyl-terminal hydrolase 30(Homo sapiens (Human))
Missions Therapeutics
US Patent
LigandPNGBDBM404438((3aR,6aR)-5-cyano-N-(2-fluoro-4-(trifluoromethyl)p...)
Affinity DataIC50: <100nM. Assay description: Dilution plates were prepared at 21 times the final concentration (2100 μM for a final concentration of 100 μM) in 50% DMSO in a 96-well po...
Ligand InfoPC cidPC sid
In DepthDetails US Patent
TargetUbiquitin carboxyl-terminal hydrolase 30(Homo sapiens (Human))
Missions Therapeutics
US Patent
LigandPNGBDBM404438((3aR,6aR)-5-cyano-N-(2-fluoro-4-(trifluoromethyl)p...)
Affinity DataIC50: <100nM. Assay description: USP30 biochemical fluorescence intensity IC50 assay Dilution plates were prepared at 21 times the final concentration (2100 μM for a final conce...
Ligand InfoPC cidPC sid
In DepthDetails US Patent