BDBM408116 1-(1-(Benzo[d][1,3]dioxol-5-yl)ethyl)-4-(6-chloropyridin-3-yl)piperazine::US10336775, Example 20::US11046712, No 20
SMILES CC(N1CCN(CC1)c1ccc(Cl)cn1)c1ccc2OCOc2c1
InChI Key InChIKey=AGVZYJJZGZTIRI-UHFFFAOYSA-N
Data  2 IC50
  Tab Delimited (TSV)   2D SDfile   Computed 3D by Vconf -m prep SDfile
Find this compound or compounds like it in BindingDB:
Activity Spreadsheet -- Enzyme Inhibition Constant Data from BindingDB
Found 2 hits for monomerid = 408116
TargetProtein O-GlcNAcase(Homo sapiens (Human))
Asceneuron
US Patent
LigandPNGBDBM408116(1-(1-(Benzo[d][1,3]dioxol-5-yl)ethyl)-4-(6-chlorop...)
Affinity DataIC50:  600nM. Assay description: 5 μI of the appropriate concentration of a solution of inhibitor in McIlvaine's Buffer (pH 6.5) in 2% DMSO (for a dose response curve calcul...
Ligand InfoPC cidPC sid
In DepthDetails US Patent
TargetProtein O-GlcNAcase(Homo sapiens (Human))
Asceneuron
US Patent
LigandPNGBDBM408116(1-(1-(Benzo[d][1,3]dioxol-5-yl)ethyl)-4-(6-chlorop...)
Affinity DataIC50:  600nM. Assay description: 5 μl of the appropriate concentration of a solution of inhibitor in McIlvaine's Buffer (pH 6.5) in 2% DMSO (for a dose response curve calcul...
Ligand InfoPC cidPC sid
In DepthDetails US Patent