BDBM408186 Ethyl-2-(4-(1-(quinoxalin-6-yl)ethyl)piperazin-1-yl)thiazole-5-carboxylate::US10336775, Example 90::US11046712, No 90
SMILES CCOC(=O)c1cnc(s1)N1CCN(CC1)C(C)c1ccc2nccnc2c1
InChI Key InChIKey=ZAQIREZFGFYQDY-UHFFFAOYSA-N
Data  2 IC50
  Tab Delimited (TSV)   2D SDfile   Computed 3D by Vconf -m prep SDfile
Find this compound or compounds like it in BindingDB:
Activity Spreadsheet -- Enzyme Inhibition Constant Data from BindingDB
Found 2 hits for monomerid = 408186
TargetProtein O-GlcNAcase(Homo sapiens (Human))
Asceneuron
US Patent
LigandPNGBDBM408186(Ethyl-2-(4-(1-(quinoxalin-6-yl)ethyl)piperazin-1-y...)
Affinity DataIC50:  600nM. Assay description: 5 μI of the appropriate concentration of a solution of inhibitor in McIlvaine's Buffer (pH 6.5) in 2% DMSO (for a dose response curve calcul...
Ligand InfoPC cidPC sid
In DepthDetails US Patent
TargetProtein O-GlcNAcase(Homo sapiens (Human))
Asceneuron
US Patent
LigandPNGBDBM408186(Ethyl-2-(4-(1-(quinoxalin-6-yl)ethyl)piperazin-1-y...)
Affinity DataIC50:  600nM. Assay description: 5 μl of the appropriate concentration of a solution of inhibitor in McIlvaine's Buffer (pH 6.5) in 2% DMSO (for a dose response curve calcul...
Ligand InfoPC cidPC sid
In DepthDetails US Patent