BDBM408241 6-(1-(4-(5-(trifluoromethyl)pyridin-2-yl)piperazin-1-yl)ethyl)quinoxaline::US10336775, Example 165::US11046712, No 165
SMILES CC(N1CCN(CC1)c1ccc(cn1)C(F)(F)F)c1ccc2nccnc2c1
InChI Key InChIKey=UEIPEZQUWBNLJW-UHFFFAOYSA-N
Data  2 IC50
  Tab Delimited (TSV)   2D SDfile   Computed 3D by Vconf -m prep SDfile
Find this compound or compounds like it in BindingDB:
Activity Spreadsheet -- Enzyme Inhibition Constant Data from BindingDB
Found 2 hits for monomerid = 408241
TargetProtein O-GlcNAcase(Homo sapiens (Human))
Asceneuron
US Patent
LigandPNGBDBM408241(6-(1-(4-(5-(trifluoromethyl)pyridin-2-yl)piperazin...)
Affinity DataIC50:  600nM. Assay description: 5 μI of the appropriate concentration of a solution of inhibitor in McIlvaine's Buffer (pH 6.5) in 2% DMSO (for a dose response curve calcul...
Ligand InfoPC cidPC sid
In DepthDetails US Patent
TargetProtein O-GlcNAcase(Homo sapiens (Human))
Asceneuron
US Patent
LigandPNGBDBM408241(6-(1-(4-(5-(trifluoromethyl)pyridin-2-yl)piperazin...)
Affinity DataIC50:  600nM. Assay description: 5 μl of the appropriate concentration of a solution of inhibitor in McIlvaine's Buffer (pH 6.5) in 2% DMSO (for a dose response curve calcul...
Ligand InfoPC cidPC sid
In DepthDetails US Patent