BDBM408275 1-(4-Bromo-3-methoxyphenyl)-4-(1-(2,3-dihydrobenzo[b][1,4]dioxin-6-yl)ethyl)piperazine::US10336775, Example 199::US11046712, No 199
SMILES COc1nc(ccc1Br)N1CCN(CC1)C(C)c1ccc2OCCOc2c1
InChI Key InChIKey=GXXIDDOAWAHAHK-UHFFFAOYSA-N
Data  2 IC50
  Tab Delimited (TSV)   2D SDfile   Computed 3D by Vconf -m prep SDfile
Find this compound or compounds like it in BindingDB:
Activity Spreadsheet -- Enzyme Inhibition Constant Data from BindingDB
Found 2 hits for monomerid = 408275
TargetProtein O-GlcNAcase(Homo sapiens (Human))
Asceneuron
US Patent
LigandPNGBDBM408275(1-(4-Bromo-3-methoxyphenyl)-4-(1-(2,3-dihydrobenzo...)
Affinity DataIC50:  125nM. Assay description: 5 μI of the appropriate concentration of a solution of inhibitor in McIlvaine's Buffer (pH 6.5) in 2% DMSO (for a dose response curve calcul...
Ligand InfoPC cidPC sid
In DepthDetails US Patent
TargetProtein O-GlcNAcase(Homo sapiens (Human))
Asceneuron
US Patent
LigandPNGBDBM408275(1-(4-Bromo-3-methoxyphenyl)-4-(1-(2,3-dihydrobenzo...)
Affinity DataIC50:  125nM. Assay description: 5 μl of the appropriate concentration of a solution of inhibitor in McIlvaine's Buffer (pH 6.5) in 2% DMSO (for a dose response curve calcul...
Ligand InfoPC cidPC sid
In DepthDetails US Patent