BDBM408713 3-(methoxymethyl)-1-({4-[(2-oxopyridin-1-yl)methyl]phenyl}methyl)-N-{[2- (trifluoromethyl)pyridin-3-yl]methyl}pyrazole-4-carboxamide::US10364238, Example 36::US11001578, Example 36::US11084809, Example 36::US11198691, Example 36
SMILES COCc1nn(Cc2ccc(Cn3ccccc3=O)cc2)cc1C(=O)NCc1cccnc1C(F)(F)F
InChI Key InChIKey=ULAOQOFMZICMAA-UHFFFAOYSA-N
Data  9 IC50
  Tab Delimited (TSV)   2D SDfile   Computed 3D by Vconf -m prep SDfile
Find this compound or compounds like it in BindingDB:
Activity Spreadsheet -- Enzyme Inhibition Constant Data from BindingDB
Found 9 hits for monomerid = 408713
TargetPlasma kallikrein(Homo sapiens (Human))
Kalvista Pharmaceuticals
US Patent
LigandPNGBDBM408713( 3-(methoxymethyl)-1-({4-[(2-oxopyridin-1-yl)methy...)
Affinity DataIC50:  4.17E+3nM. Assay description: Plasma kallikrein inhibitory activity in vitro was determined using standard published methods. Human plasma kallikrein (Protogen) was incubated at 2...
Ligand InfoPC cidPC sid
In DepthDetails US Patent
TargetKallikrein-1(Homo sapiens (Human))
Kalvista Pharmaceuticals
US Patent
LigandPNGBDBM408713( 3-(methoxymethyl)-1-({4-[(2-oxopyridin-1-yl)methy...)
Affinity DataIC50: >1.00E+4nM. Assay description: KLK1 inhibitory activity in vitro was determined using standard published methods. Human KLK1 (Callbiochem) was incubated at 25° C. with the fluorog...
Ligand InfoPC cidPC sid
In DepthDetails US Patent
TargetPlasma kallikrein(Homo sapiens (Human))
Kalvista Pharmaceuticals
US Patent
LigandPNGBDBM408713( 3-(methoxymethyl)-1-({4-[(2-oxopyridin-1-yl)methy...)
Affinity DataIC50:  4.17E+3nM. Assay description: Plasma kallikrein inhibitory activity in vitro was determined using standard published methods (see e.g. Johansen et al., Int. J. Tiss. Reac. 1986, 8...
Ligand InfoPC cidPC sid
In DepthDetails US Patent
TargetKallikrein-1(Homo sapiens (Human))
Kalvista Pharmaceuticals
US Patent
LigandPNGBDBM408713( 3-(methoxymethyl)-1-({4-[(2-oxopyridin-1-yl)methy...)
Affinity DataIC50: >1.00E+4nM. Assay description: KLK1 inhibitory activity in vitro was determined using standard published methods (see e.g. Johansen et al., Int. J. Tiss. Reac. 1986, 8, 185; Shori ...
Ligand InfoPC cidPC sid
In DepthDetails US Patent
TargetPlasma kallikrein(Homo sapiens (Human))
Kalvista Pharmaceuticals
US Patent
LigandPNGBDBM408713( 3-(methoxymethyl)-1-({4-[(2-oxopyridin-1-yl)methy...)
Affinity DataIC50:  4.20E+3nM. Assay description: Inhibition of human plasma kallikrein using H-D-Pro-Phe-Arg-AFC as flurogenic substrate preincubated for 5 mins followed by substrate addition by flu...
Ligand InfoPC cidPC sid
In DepthDetails PubMed
TargetKallikrein-1(Homo sapiens (Human))
Kalvista Pharmaceuticals
US Patent
LigandPNGBDBM408713( 3-(methoxymethyl)-1-({4-[(2-oxopyridin-1-yl)methy...)
Affinity DataIC50: >1.00E+4nM. Assay description: KLK1 inhibitory activity in vitro was determined using standard published methods (see e.g. Johansen et al., Int. J. Tiss. Reac. 1986, 8, 185; Shori ...
Ligand InfoPC cidPC sid
In DepthDetails US Patent
TargetPlasma kallikrein(Homo sapiens (Human))
Kalvista Pharmaceuticals
US Patent
LigandPNGBDBM408713( 3-(methoxymethyl)-1-({4-[(2-oxopyridin-1-yl)methy...)
Affinity DataIC50:  4.17E+3nM. Assay description: KLK1 inhibitory activity in vitro was determined using standard published methods. Human KLK1 (Callbiochem) was incubated at 25° C. with the fluoroge...
Ligand InfoPC cidPC sid
In DepthDetails US Patent
TargetKallikrein-1(Homo sapiens (Human))
Kalvista Pharmaceuticals
US Patent
LigandPNGBDBM408713( 3-(methoxymethyl)-1-({4-[(2-oxopyridin-1-yl)methy...)
Affinity DataIC50: >1.00E+4nM. Assay description: Plasma kallikrein inhibitory activity in vitro was determined using standard published methods. Human plasma kallikrein (Protogen) was incubated at 2...
Ligand InfoPC cidPC sid
In DepthDetails US Patent
TargetPlasma kallikrein(Homo sapiens (Human))
Kalvista Pharmaceuticals
US Patent
LigandPNGBDBM408713( 3-(methoxymethyl)-1-({4-[(2-oxopyridin-1-yl)methy...)
Affinity DataIC50:  4.17E+3nM. Assay description: Plasma kallikrein inhibitory activity in vitro was determined using standard published methods (see e.g. Johansen et al., Int. J. Tiss. Reac. 1986, 8...
Ligand InfoPC cidPC sid
In DepthDetails US Patent