BDBM415116 Intermediate 1-2-45::US10428044, Example 216
SMILES CC1(C)Cc2[nH]c(c(Nc3ccccc3)c2C(=O)C1)-c1cc(Cl)nc(Cl)c1
InChI Key InChIKey=CSJKLHWIAHTLRC-UHFFFAOYSA-N
Data  1 IC50
  Tab Delimited (TSV)   2D SDfile   Computed 3D by Vconf -m prep SDfile
Find this compound or compounds like it in BindingDB:
Activity Spreadsheet -- Enzyme Inhibition Constant Data from BindingDB
Found 1 hit for monomerid = 415116
TargetMitotic checkpoint serine/threonine-protein kinase BUB1(Homo sapiens (Human))
Bayer Pharma Aktiengesellschaft
US Patent
LigandPNGBDBM415116(Intermediate 1-2-45 | US10428044, Example 216)
Affinity DataIC50: >2.00E+4nM. Assay description: In a typical assay 11 different concentrations of each compound (0.1 nM, 0.33 nM, 1.1 nM, 3.8 nM, 13 nM, 44 nM, 0.15 μM, 0.51 μM, 1.7 μ...
Ligand InfoPC cidPC sid
In DepthDetails US Patent