BDBM418230 (2R)-2-(6-{5-chloro-2-[(oxan-4- yl)amino]pyrimidin-4-yl}-1-oxo-2,3- dihydro-1H-isoindol-2-yl)-N-[(1S)-1-[3- chloro-6-(4-methylpiperazin-1- yl)pyridin-2-yl]-2- hydroxyethyl]propanamide::US10457669, Example 997::US11001575, Example 997
SMILES C[C@@H](N1Cc2ccc(cc2C1=O)-c1nc(NC2CCOCC2)ncc1Cl)C(=O)N[C@H](CO)c1nc(ccc1Cl)N1CCN(C)CC1
InChI Key InChIKey=RRKOFKIKYBICOT-NIYFSFCBSA-N
Data  2 IC50
  Tab Delimited (TSV)   2D SDfile   Computed 3D by Vconf -m prep SDfile
Find this compound or compounds like it in BindingDB:
Activity Spreadsheet -- Enzyme Inhibition Constant Data from BindingDB
Found 2 hits for monomerid = 418230
TargetMitogen-activated protein kinase 1(Homo sapiens (Human))
Otsuka Pharmaceutical
US Patent
LigandPNGBDBM418230((2R)-2-(6-{5-chloro-2-[(oxan-4- yl)amino]pyrimidin...)
Affinity DataIC50:  1.40nM. Assay description: Activity of ERK2 enzyme (Life Technologies) was determined using a time-resolved fluorescence format measuring the phosphorylation of a truncated ver...
Ligand InfoPC cidPC sid
In DepthDetails US Patent
TargetMitogen-activated protein kinase 1(Homo sapiens (Human))
Otsuka Pharmaceutical
US Patent
LigandPNGBDBM418230((2R)-2-(6-{5-chloro-2-[(oxan-4- yl)amino]pyrimidin...)
Affinity DataIC50:  1.40nM. Assay description: Activity of ERK2 enzyme (Life Technologies) was determined using a time-resolved fluorescence format measuring the phosphorylation of a truncated ver...
Ligand InfoPC cidPC sid
In DepthDetails US Patent