BDBM418237 (2R)-2-(6-{5-chloro-2-[(2-methyl-2H- 1,2,3-triazol-4-yl)amino]pyrimidin-4- yl}-1-oxo-2,3-dihydro-1H-isoindol-2- yl)-N-[(1R)-1-{6-[(3S)-3- (dimethylamino)pyrrolidin-1-yl]pyridin- 2-yl}ethyl]propanamide::US10457669, Example 1005::US11001575, Example 1005
SMILES C[C@@H](NC(=O)[C@@H](C)N1Cc2ccc(cc2C1=O)-c1nc(Nc2cnn(C)n2)ncc1Cl)c1cccc(n1)N1CC[C@@H](C1)N(C)C
InChI Key InChIKey=PPLHGLBOZDCXJB-KNKQGSTJSA-N
Data  2 IC50
  Tab Delimited (TSV)   2D SDfile   Computed 3D by Vconf -m prep SDfile
Find this compound or compounds like it in BindingDB:
Activity Spreadsheet -- Enzyme Inhibition Constant Data from BindingDB
Found 2 hits for monomerid = 418237
TargetMitogen-activated protein kinase 1(Homo sapiens (Human))
Otsuka Pharmaceutical
US Patent
LigandPNGBDBM418237((2R)-2-(6-{5-chloro-2-[(2-methyl-2H- 1,2,3-triazol...)
Affinity DataIC50:  1.90nM. Assay description: Activity of ERK2 enzyme (Life Technologies) was determined using a time-resolved fluorescence format measuring the phosphorylation of a truncated ver...
Ligand InfoPC cidPC sid
In DepthDetails US Patent
TargetMitogen-activated protein kinase 1(Homo sapiens (Human))
Otsuka Pharmaceutical
US Patent
LigandPNGBDBM418237((2R)-2-(6-{5-chloro-2-[(2-methyl-2H- 1,2,3-triazol...)
Affinity DataIC50:  1.90nM. Assay description: Activity of ERK2 enzyme (Life Technologies) was determined using a time-resolved fluorescence format measuring the phosphorylation of a truncated ver...
Ligand InfoPC cidPC sid
In DepthDetails US Patent