BDBM420281 HL-1
SMILES Cc1cc(Cl)cc(Cc2cc(Cl)cc(C)c2O)c1O
InChI Key InChIKey=PLYLXUREZURVOA-UHFFFAOYSA-N
Data  1 IC50
  Tab Delimited (TSV)   2D SDfile   Computed 3D by Vconf -m prep SDfile
Find this compound or compounds like it in BindingDB:
Activity Spreadsheet -- Enzyme Inhibition Constant Data from BindingDB
Found 1 hit for monomerid = 420281
TargetReplicase polyprotein 1a(Human SARS coronavirus (SARS-CoV))
National Taiwan University
LigandPNGBDBM420281(HL-1)
Affinity DataIC50:  4.60E+4nM. Assay description: To establish a high-throughput screening method, we designed a FRET peptide, Abz-SAVLQSGFRK-Dnp, as 3CLpro substrate. The FRET peptide was synthesize...
Ligand InfoPurchase
In DepthDetails ArticlePubMed