BDBM420287 HL-6::acs.jmedchem.1c00409_ST.470
SMILES CC(=O)Oc1c(Cl)cc(Cl)c(Cl)c1Sc1c(Cl)c(Cl)cc(Cl)c1OC(C)=O
InChI Key InChIKey=LRQGLGUUTAFTJW-UHFFFAOYSA-N
Data  2 IC50
  Tab Delimited (TSV)   2D SDfile   Computed 3D by Vconf -m prep SDfile
Find this compound or compounds like it in BindingDB:
Activity Spreadsheet -- Enzyme Inhibition Constant Data from BindingDB
Found 2 hits for monomerid = 420287
TargetReplicase polyprotein 1ab(Human SARS coronavirus (SARS-CoV) (Severe acute re...)
Michigan State University
LigandPNGBDBM420287(HL-6 | acs.jmedchem.1c00409_ST.470)
Affinity DataIC50:  7.60E+3nM. Assay description: This is a review article. Please point to the original journal.
Ligand InfoPurchase
In DepthDetails ArticlePubMed
TargetReplicase polyprotein 1a(Human SARS coronavirus (SARS-CoV))
National Taiwan University
LigandPNGBDBM420287(HL-6 | acs.jmedchem.1c00409_ST.470)
Affinity DataIC50:  4.60E+4nM. Assay description: To establish a high-throughput screening method, we designed a FRET peptide, Abz-SAVLQSGFRK-Dnp, as 3CLpro substrate. The FRET peptide was synthesize...
Ligand InfoPurchase
In DepthDetails ArticlePubMed