BDBM420960 US9975885, Compound 19
SMILES CC(C)C(=O)Nc1ccc(cc1)N(C(C(=O)NCc1ccccc1)c1cccc(F)c1)C(=O)Cn1cnc2ccccc12
InChI Key InChIKey=KPPSXCWYWNNTOU-UHFFFAOYSA-N
Data  4 IC50
  Tab Delimited (TSV)   2D SDfile   Computed 3D by Vconf -m prep SDfile
Find this compound or compounds like it in BindingDB:
Activity Spreadsheet -- Enzyme Inhibition Constant Data from BindingDB
Found 4 hits for monomerid = 420960
TargetReplicase polyprotein 1ab(HCoV-HKU1)
Purdue Research Foundation
US Patent
LigandPNGBDBM420960(US9975885, Compound 19)
Affinity DataIC50:  3.70E+3nM. Assay description: The inhibitor library was first screened for inhibition of each 3CLpro at a concentration of 100 μM in duplicate assays containing the following...
Ligand Info
In DepthDetails US Patent
TargetReplicase polyprotein 1ab(BtCoV)
Purdue Research Foundation
US Patent
LigandPNGBDBM420960(US9975885, Compound 19)
Affinity DataIC50:  2.90E+3nM. Assay description: The inhibitor library was first screened for inhibition of each 3CLpro at a concentration of 100 μM in duplicate assays containing the following...
Ligand Info
In DepthDetails US Patent
TargetReplicase polyprotein 1ab(BtCoV)
Purdue Research Foundation
US Patent
LigandPNGBDBM420960(US9975885, Compound 19)
Affinity DataIC50:  2.50E+3nM. Assay description: The inhibitor library was first screened for inhibition of each 3CLpro at a concentration of 100 μM in duplicate assays containing the following...
Ligand Info
In DepthDetails US Patent
TargetReplicase polyprotein 1ab(HCoV-OC43)
Purdue Research Foundation
US Patent
LigandPNGBDBM420960(US9975885, Compound 19)
Affinity DataIC50:  3.90E+3nM. Assay description: The inhibitor library was first screened for inhibition of each 3CLpro at a concentration of 100 μM in duplicate assays containing the following...
Ligand Info
In DepthDetails US Patent