BDBM420988 US9975885, Compound 41
SMILES CC(C)(C)NC(=O)C(N(C(=O)c1c[nH]cn1)c1ccc(cc1)C1CCCC1)c1cccnc1
InChI Key
Data  6 IC50
  Tab Delimited (TSV)   2D SDfile   Computed 3D by Vconf -m prep SDfile
Find this compound or compounds like it in BindingDB:
Activity Spreadsheet -- Enzyme Inhibition Constant Data from BindingDB
Found 6 hits for monomerid = 420988
TargetReplicase polyprotein 1ab(Feline coronavirus (strain FIPV WSU-79/1146) (FCoV...)
Purdue Research Foundation
US Patent
LigandPNGBDBM420988(US9975885, Compound 41)
Affinity DataIC50:  1.87E+4nM. Assay description: The inhibitor library was first screened for inhibition of each 3CLpro at a concentration of 100 μM in duplicate assays containing the following...
Ligand Info
In DepthDetails US Patent
TargetReplicase polyprotein 1ab(PEDV)
Purdue Research Foundation
US Patent
LigandPNGBDBM420988(US9975885, Compound 41)
Affinity DataIC50:  1.05E+4nM. Assay description: The inhibitor library was first screened for inhibition of each 3CLpro at a concentration of 100 μM in duplicate assays containing the following...
Ligand Info
In DepthDetails US Patent
TargetReplicase polyprotein 1ab(BtCoV)
Purdue Research Foundation
US Patent
LigandPNGBDBM420988(US9975885, Compound 41)
Affinity DataIC50:  1.91E+4nM. Assay description: The inhibitor library was first screened for inhibition of each 3CLpro at a concentration of 100 μM in duplicate assays containing the following...
Ligand Info
In DepthDetails US Patent
TargetReplicase polyprotein 1ab(Human SARS coronavirus (SARS-CoV) (Severe acute re...)
Purdue Research Foundation
US Patent
LigandPNGBDBM420988(US9975885, Compound 41)
Affinity DataIC50:  5.30E+3nM. Assay description: The inhibitor library was first screened for inhibition of each 3CLpro at a concentration of 100 μM in duplicate assays containing the following...
Ligand Info
In DepthDetails US Patent
TargetReplicase polyprotein 1ab(BtCoV)
Purdue Research Foundation
US Patent
LigandPNGBDBM420988(US9975885, Compound 41)
Affinity DataIC50:  1.98E+4nM. Assay description: The inhibitor library was first screened for inhibition of each 3CLpro at a concentration of 100 μM in duplicate assays containing the following...
Ligand Info
In DepthDetails US Patent
TargetReplicase polyprotein 1ab(HCoV-HKU1)
Purdue Research Foundation
US Patent
LigandPNGBDBM420988(US9975885, Compound 41)
Affinity DataIC50:  5.00E+3nM. Assay description: The inhibitor library was first screened for inhibition of each 3CLpro at a concentration of 100 μM in duplicate assays containing the following...
Ligand Info
In DepthDetails US Patent