BDBM42474 5-[[(3-methyl-4-oxo-5,6,7,8-tetrahydro-[1]benzothiolo[2,3-d]pyrimidin-2-yl)thio]methyl]-2-furancarboxylic acid methyl ester::5-[[(4-keto-3-methyl-5,6,7,8-tetrahydrobenzothiopheno[2,3-d]pyrimidin-2-yl)thio]methyl]furan-2-carboxylic acid methyl ester::MLS000098477::SMR000065138::cid_2577652::methyl 5-[(3-methyl-4-oxidanylidene-5,6,7,8-tetrahydro-[1]benzothiolo[2,3-d]pyrimidin-2-yl)sulfanylmethyl]furan-2-carboxylate::methyl 5-[(3-methyl-4-oxo-5,6,7,8-tetrahydro-[1]benzothiolo[2,3-d]pyrimidin-2-yl)sulfanylmethyl]furan-2-carboxylate
SMILES COC(=O)c1ccc(CSc2nc3sc4CCCCc4c3c(=O)n2C)o1
InChI Key InChIKey=DDXJIWNRUUDOEA-UHFFFAOYSA-N
Data  1 IC50
  Tab Delimited (TSV)   2D SDfile   Computed 3D by Vconf -m prep SDfile
Find this compound or compounds like it in BindingDB:
Activity Spreadsheet -- Enzyme Inhibition Constant Data from BindingDB
Found 1 hit for monomerid = 42474
TargetNeuropeptide Y receptor type 1(Homo sapiens (Human))
The Scripps Research Institute Molecular Screening Center
Curated by PubChem BioAssay
LigandPNGBDBM42474(5-[[(3-methyl-4-oxo-5,6,7,8-tetrahydro-[1]benzothi...)
Affinity DataIC50:  6.95E+3nM. Assay description: Source (MLSCN Center Name): The Scripps Research Institute Molecular Screening Center Affiliation: The Scripps Research Institute, TSRI Assay Provide...
In DepthDetails PCBioAssay