BDBM42491 2-methylpropyl 9-hydroxyiminofluorene-4-carboxylate::9-hydroximinofluorene-4-carboxylic acid isobutyl ester::9-hydroxyimino-4-fluorenecarboxylic acid 2-methylpropyl ester::MLS000594477::SMR000114655::cid_6745795::isobutyl 9-(hydroxyimino)-9H-fluorene-4-carboxylate
SMILES CC(C)COC(=O)c1cccc2C(N=O)c3ccccc3-c12
InChI Key InChIKey=IZTUXQCHDRJIEU-UHFFFAOYSA-N
Data  1 IC50  1 EC50
  Tab Delimited (TSV)   2D SDfile   Computed 3D by Vconf -m prep SDfile
Find this compound or compounds like it in BindingDB:
Activity Spreadsheet -- Enzyme Inhibition Constant Data from BindingDB
Found 2 hits for monomerid = 42491
TargetStreptokinase A(Streptococcus pyogenes M1 GAS)
Broad Institute
Curated by PubChem BioAssay
LigandPNGBDBM42491(2-methylpropyl 9-hydroxyiminofluorene-4-carboxylat...)
Affinity DataEC50:  5.00E+4nM. Assay description: Keywords: Group A streptococcus, GAS, streptokinase, expression, virulence, inhibition, dose response, EC50 Assay Overview: The goal of this assa...
In DepthDetails PCBioAssay
TargetNeuropeptide Y receptor type 1(Homo sapiens (Human))
The Scripps Research Institute Molecular Screening Center
Curated by PubChem BioAssay
LigandPNGBDBM42491(2-methylpropyl 9-hydroxyiminofluorene-4-carboxylat...)
Affinity DataIC50:  6.46E+3nM. Assay description: Source (MLSCN Center Name): The Scripps Research Institute Molecular Screening Center Affiliation: The Scripps Research Institute, TSRI Assay Provide...
In DepthDetails PCBioAssay