BDBM42562 4-[(5-bromanyl-2,4-dimethoxy-phenyl)methylideneamino]-3-ethyl-1H-1,2,4-triazole-5-thione::4-[(5-bromo-2,4-dimethoxy-benzylidene)amino]-3-ethyl-1H-1,2,4-triazole-5-thione::4-[(5-bromo-2,4-dimethoxybenzylidene)amino]-5-ethyl-4H-1,2,4-triazole-3-thiol::4-[(5-bromo-2,4-dimethoxyphenyl)methylideneamino]-3-ethyl-1H-1,2,4-triazole-5-thione::4-[(E)-(5-bromo-2,4-dimethoxy-benzylidene)amino]-3-ethyl-1H-1,2,4-triazole-5-thione::MLS000681048::SMR000269318::cid_1339564
SMILES CCc1n[nH]c(=S)n1N=Cc1cc(Br)c(OC)cc1OC
InChI Key InChIKey=OWZRLLMPBDDLLW-UHFFFAOYSA-N
Data  2 IC50
  Tab Delimited (TSV)   2D SDfile   Computed 3D by Vconf -m prep SDfile
Find this compound or compounds like it in BindingDB:
Activity Spreadsheet -- Enzyme Inhibition Constant Data from BindingDB
Found 2 hits for monomerid = 42562
TargetMitochondrial peptide methionine sulfoxide reductase(Bos taurus)
The Scripps Research Institute Molecular Screening Center
Curated by PubChem BioAssay
LigandPNGBDBM42562(4-[(5-bromanyl-2,4-dimethoxy-phenyl)methylideneami...)
Affinity DataIC50: >1.55E+5nM
In DepthDetails PCBioAssay
TargetNeuropeptide Y receptor type 1(Homo sapiens (Human))
The Scripps Research Institute Molecular Screening Center
Curated by PubChem BioAssay
LigandPNGBDBM42562(4-[(5-bromanyl-2,4-dimethoxy-phenyl)methylideneami...)
Affinity DataIC50: >3.50E+4nM. Assay description: Source (MLSCN Center Name): The Scripps Research Institute Molecular Screening Center Affiliation: The Scripps Research Institute, TSRI Assay Provide...
In DepthDetails PCBioAssay