BDBM427565 1-(4-(2-(7,8-dimethyl-[1,2,4]triazolo[1,5-a]pyridin-6-yl)-3-isopropyl-1H-pyrrolo[3,2-b]pyridin-5-yl)piperazin-1-yl)-2-(dimethylamino)ethan-1-one::US10544143, Example 3::US10544143, Example 831::US10544143, Example 858::US10544143, Example 859::US10544143, Example 888::US10544143, Example 889::US10544143, Example 890::US10544143, Example 891::US10730877, Example 891::US11053244, Example 891
SMILES CC(C)c1c([nH]c2ccc(nc12)N1CCN(CC1)C(=O)CN(C)C)-c1cn2ncnc2c(C)c1C
InChI Key InChIKey=SGDXORDHVQLRIU-UHFFFAOYSA-N
Data  72 IC50
  Tab Delimited (TSV)   2D SDfile   Computed 3D by Vconf -m prep SDfile
Find this compound or compounds like it in BindingDB:
Activity Spreadsheet -- Enzyme Inhibition Constant Data from BindingDB
Found 72 hits for monomerid = 427565
TargetToll-like receptor 7(Homo sapiens (Human))
Bristol-Myers Squibb
US Patent
LigandPNGBDBM427565(1-(4-(2-(7,8-dimethyl-[1,2,4]triazolo[1,5-a]pyridi...)
Affinity DataIC50:  1.5nM. Assay description: HEK-Blue-cells (Invivogen) overexpressing human TLR7, TLR8 or TLR9 receptors were used for screening inhibitors of these receptors using an inducible...
Ligand InfoPC cidPC sid
In DepthDetails US Patent
TargetToll-like receptor 8(Homo sapiens (Human))
Bristol-Myers Squibb
US Patent
LigandPNGBDBM427565(1-(4-(2-(7,8-dimethyl-[1,2,4]triazolo[1,5-a]pyridi...)
Affinity DataIC50:  2.30nM. Assay description: HEK-Blue-cells (Invivogen) overexpressing human TLR7, TLR8 or TLR9 receptors were used for screening inhibitors of these receptors using an inducible...
Ligand InfoPC cidPC sid
In DepthDetails US Patent
TargetToll-like receptor 9(Homo sapiens (Human))
Bristol-Myers Squibb
US Patent
LigandPNGBDBM427565(1-(4-(2-(7,8-dimethyl-[1,2,4]triazolo[1,5-a]pyridi...)
Affinity DataIC50:  8.55E+3nM. Assay description: HEK-Blue-cells (Invivogen) overexpressing human TLR7, TLR8 or TLR9 receptors were used for screening inhibitors of these receptors using an inducible...
Ligand InfoPC cidPC sid
In DepthDetails US Patent
TargetToll-like receptor 7(Homo sapiens (Human))
Bristol-Myers Squibb
US Patent
LigandPNGBDBM427565(1-(4-(2-(7,8-dimethyl-[1,2,4]triazolo[1,5-a]pyridi...)
Affinity DataIC50:  1.10nM. Assay description: HEK-Blue-cells (Invivogen) overexpressing human TLR7, TLR8 or TLR9 receptors were used for screening inhibitors of these receptors using an inducible...
Ligand InfoPC cidPC sid
In DepthDetails US Patent
TargetToll-like receptor 8(Homo sapiens (Human))
Bristol-Myers Squibb
US Patent
LigandPNGBDBM427565(1-(4-(2-(7,8-dimethyl-[1,2,4]triazolo[1,5-a]pyridi...)
Affinity DataIC50:  1.30nM. Assay description: HEK-Blue-cells (Invivogen) overexpressing human TLR7, TLR8 or TLR9 receptors were used for screening inhibitors of these receptors using an inducible...
Ligand InfoPC cidPC sid
In DepthDetails US Patent
TargetToll-like receptor 9(Homo sapiens (Human))
Bristol-Myers Squibb
US Patent
LigandPNGBDBM427565(1-(4-(2-(7,8-dimethyl-[1,2,4]triazolo[1,5-a]pyridi...)
Affinity DataIC50:  7.13E+3nM. Assay description: HEK-Blue-cells (Invivogen) overexpressing human TLR7, TLR8 or TLR9 receptors were used for screening inhibitors of these receptors using an inducible...
Ligand InfoPC cidPC sid
In DepthDetails US Patent
TargetToll-like receptor 7(Homo sapiens (Human))
Bristol-Myers Squibb
US Patent
LigandPNGBDBM427565(1-(4-(2-(7,8-dimethyl-[1,2,4]triazolo[1,5-a]pyridi...)
Affinity DataIC50:  0.970nM. Assay description: HEK-Blue-cells (Invivogen) overexpressing human TLR7, TLR8 or TLR9 receptors were used for screening inhibitors of these receptors using an inducible...
Ligand InfoPC cidPC sid
In DepthDetails US Patent
TargetToll-like receptor 8(Homo sapiens (Human))
Bristol-Myers Squibb
US Patent
LigandPNGBDBM427565(1-(4-(2-(7,8-dimethyl-[1,2,4]triazolo[1,5-a]pyridi...)
Affinity DataIC50:  1.5nM. Assay description: HEK-Blue-cells (Invivogen) overexpressing human TLR7, TLR8 or TLR9 receptors were used for screening inhibitors of these receptors using an inducible...
Ligand InfoPC cidPC sid
In DepthDetails US Patent
TargetToll-like receptor 9(Homo sapiens (Human))
Bristol-Myers Squibb
US Patent
LigandPNGBDBM427565(1-(4-(2-(7,8-dimethyl-[1,2,4]triazolo[1,5-a]pyridi...)
Affinity DataIC50:  7.31E+3nM. Assay description: HEK-Blue-cells (Invivogen) overexpressing human TLR7, TLR8 or TLR9 receptors were used for screening inhibitors of these receptors using an inducible...
Ligand InfoPC cidPC sid
In DepthDetails US Patent
TargetToll-like receptor 7(Homo sapiens (Human))
Bristol-Myers Squibb
US Patent
LigandPNGBDBM427565(1-(4-(2-(7,8-dimethyl-[1,2,4]triazolo[1,5-a]pyridi...)
Affinity DataIC50:  1.20nM. Assay description: HEK-Blue-cells (Invivogen) overexpressing human TLR7, TLR8 or TLR9 receptors were used for screening inhibitors of these receptors using an inducible...
Ligand InfoPC cidPC sid
In DepthDetails US Patent
TargetToll-like receptor 8(Homo sapiens (Human))
Bristol-Myers Squibb
US Patent
LigandPNGBDBM427565(1-(4-(2-(7,8-dimethyl-[1,2,4]triazolo[1,5-a]pyridi...)
Affinity DataIC50:  0.590nM. Assay description: HEK-Blue-cells (Invivogen) overexpressing human TLR7, TLR8 or TLR9 receptors were used for screening inhibitors of these receptors using an inducible...
Ligand InfoPC cidPC sid
In DepthDetails US Patent
TargetToll-like receptor 9(Homo sapiens (Human))
Bristol-Myers Squibb
US Patent
LigandPNGBDBM427565(1-(4-(2-(7,8-dimethyl-[1,2,4]triazolo[1,5-a]pyridi...)
Affinity DataIC50:  1.22E+4nM. Assay description: HEK-Blue-cells (Invivogen) overexpressing human TLR7, TLR8 or TLR9 receptors were used for screening inhibitors of these receptors using an inducible...
Ligand InfoPC cidPC sid
In DepthDetails US Patent
TargetToll-like receptor 7(Homo sapiens (Human))
Bristol-Myers Squibb
US Patent
LigandPNGBDBM427565(1-(4-(2-(7,8-dimethyl-[1,2,4]triazolo[1,5-a]pyridi...)
Affinity DataIC50:  1.5nM. Assay description: HEK-Blue-cells (Invivogen) overexpressing human TLR7, TLR8 or TLR9 receptors were used for screening inhibitors of these receptors using an inducible...
Ligand InfoPC cidPC sid
In DepthDetails US Patent
TargetToll-like receptor 8(Homo sapiens (Human))
Bristol-Myers Squibb
US Patent
LigandPNGBDBM427565(1-(4-(2-(7,8-dimethyl-[1,2,4]triazolo[1,5-a]pyridi...)
Affinity DataIC50:  0.760nM. Assay description: HEK-Blue-cells (Invivogen) overexpressing human TLR7, TLR8 or TLR9 receptors were used for screening inhibitors of these receptors using an inducible...
Ligand InfoPC cidPC sid
In DepthDetails US Patent
TargetToll-like receptor 9(Homo sapiens (Human))
Bristol-Myers Squibb
US Patent
LigandPNGBDBM427565(1-(4-(2-(7,8-dimethyl-[1,2,4]triazolo[1,5-a]pyridi...)
Affinity DataIC50:  9.84E+3nM. Assay description: HEK-Blue-cells (Invivogen) overexpressing human TLR7, TLR8 or TLR9 receptors were used for screening inhibitors of these receptors using an inducible...
Ligand InfoPC cidPC sid
In DepthDetails US Patent
TargetToll-like receptor 7(Homo sapiens (Human))
Bristol-Myers Squibb
US Patent
LigandPNGBDBM427565(1-(4-(2-(7,8-dimethyl-[1,2,4]triazolo[1,5-a]pyridi...)
Affinity DataIC50:  1.80nM. Assay description: HEK-Blue-cells (Invivogen) overexpressing human TLR7, TLR8 or TLR9 receptors were used for screening inhibitors of these receptors using an inducible...
Ligand InfoPC cidPC sid
In DepthDetails US Patent
TargetToll-like receptor 8(Homo sapiens (Human))
Bristol-Myers Squibb
US Patent
LigandPNGBDBM427565(1-(4-(2-(7,8-dimethyl-[1,2,4]triazolo[1,5-a]pyridi...)
Affinity DataIC50:  1.40nM. Assay description: HEK-Blue-cells (Invivogen) overexpressing human TLR7, TLR8 or TLR9 receptors were used for screening inhibitors of these receptors using an inducible...
Ligand InfoPC cidPC sid
In DepthDetails US Patent
TargetToll-like receptor 9(Homo sapiens (Human))
Bristol-Myers Squibb
US Patent
LigandPNGBDBM427565(1-(4-(2-(7,8-dimethyl-[1,2,4]triazolo[1,5-a]pyridi...)
Affinity DataIC50:  1.47E+4nM. Assay description: HEK-Blue-cells (Invivogen) overexpressing human TLR7, TLR8 or TLR9 receptors were used for screening inhibitors of these receptors using an inducible...
Ligand InfoPC cidPC sid
In DepthDetails US Patent
TargetToll-like receptor 7(Homo sapiens (Human))
Bristol-Myers Squibb
US Patent
LigandPNGBDBM427565(1-(4-(2-(7,8-dimethyl-[1,2,4]triazolo[1,5-a]pyridi...)
Affinity DataIC50:  0.640nM. Assay description: HEK-Blue-cells (Invivogen) overexpressing human TLR7, TLR8 or TLR9 receptors were used for screening inhibitors of these receptors using an inducible...
Ligand InfoPC cidPC sid
In DepthDetails US Patent
TargetToll-like receptor 8(Homo sapiens (Human))
Bristol-Myers Squibb
US Patent
LigandPNGBDBM427565(1-(4-(2-(7,8-dimethyl-[1,2,4]triazolo[1,5-a]pyridi...)
Affinity DataIC50:  0.930nM. Assay description: HEK-Blue-cells (Invivogen) overexpressing human TLR7, TLR8 or TLR9 receptors were used for screening inhibitors of these receptors using an inducible...
Ligand InfoPC cidPC sid
In DepthDetails US Patent
TargetToll-like receptor 9(Homo sapiens (Human))
Bristol-Myers Squibb
US Patent
LigandPNGBDBM427565(1-(4-(2-(7,8-dimethyl-[1,2,4]triazolo[1,5-a]pyridi...)
Affinity DataIC50:  1.80E+4nM. Assay description: HEK-Blue-cells (Invivogen) overexpressing human TLR7, TLR8 or TLR9 receptors were used for screening inhibitors of these receptors using an inducible...
Ligand InfoPC cidPC sid
In DepthDetails US Patent
TargetToll-like receptor 7(Homo sapiens (Human))
Bristol-Myers Squibb
US Patent
LigandPNGBDBM427565(1-(4-(2-(7,8-dimethyl-[1,2,4]triazolo[1,5-a]pyridi...)
Affinity DataIC50:  0.930nM. Assay description: HEK-Blue-cells (Invivogen) overexpressing human TLR7, TLR8 or TLR9 receptors were used for screening inhibitors of these receptors using an inducible...
Ligand InfoPC cidPC sid
In DepthDetails US Patent
TargetToll-like receptor 8(Homo sapiens (Human))
Bristol-Myers Squibb
US Patent
LigandPNGBDBM427565(1-(4-(2-(7,8-dimethyl-[1,2,4]triazolo[1,5-a]pyridi...)
Affinity DataIC50:  1.10nM. Assay description: HEK-Blue-cells (Invivogen) overexpressing human TLR7, TLR8 or TLR9 receptors were used for screening inhibitors of these receptors using an inducible...
Ligand InfoPC cidPC sid
In DepthDetails US Patent
TargetToll-like receptor 9(Homo sapiens (Human))
Bristol-Myers Squibb
US Patent
LigandPNGBDBM427565(1-(4-(2-(7,8-dimethyl-[1,2,4]triazolo[1,5-a]pyridi...)
Affinity DataIC50:  8.54E+3nM. Assay description: HEK-Blue-cells (Invivogen) overexpressing human TLR7, TLR8 or TLR9 receptors were used for screening inhibitors of these receptors using an inducible...
Ligand InfoPC cidPC sid
In DepthDetails US Patent
TargetToll-like receptor 7(Homo sapiens (Human))
Bristol-Myers Squibb
US Patent
LigandPNGBDBM427565(1-(4-(2-(7,8-dimethyl-[1,2,4]triazolo[1,5-a]pyridi...)
Affinity DataIC50:  1.5nM. Assay description: HEK-Blue-cells (Invivogen) overexpressing human TLR7, TLR8 or TLR9 receptors were used for screening inhibitors of these receptors using an inducible...
Ligand InfoPC cidPC sid
In DepthDetails US Patent
TargetToll-like receptor 8(Homo sapiens (Human))
Bristol-Myers Squibb
US Patent
LigandPNGBDBM427565(1-(4-(2-(7,8-dimethyl-[1,2,4]triazolo[1,5-a]pyridi...)
Affinity DataIC50:  2.30nM. Assay description: HEK-Blue-cells (Invivogen) overexpressing human TLR7, TLR8 or TLR9 receptors were used for screening inhibitors of these receptors using an inducible...
Ligand InfoPC cidPC sid
In DepthDetails US Patent
TargetToll-like receptor 9(Homo sapiens (Human))
Bristol-Myers Squibb
US Patent
LigandPNGBDBM427565(1-(4-(2-(7,8-dimethyl-[1,2,4]triazolo[1,5-a]pyridi...)
Affinity DataIC50:  8.55E+3nM. Assay description: HEK-Blue-cells (Invivogen) overexpressing human TLR7, TLR8 or TLR9 receptors were used for screening inhibitors of these receptors using an inducible...
Ligand InfoPC cidPC sid
In DepthDetails US Patent
TargetToll-like receptor 7(Homo sapiens (Human))
Bristol-Myers Squibb
US Patent
LigandPNGBDBM427565(1-(4-(2-(7,8-dimethyl-[1,2,4]triazolo[1,5-a]pyridi...)
Affinity DataIC50:  1.10nM. Assay description: HEK-Blue-cells (Invivogen) overexpressing human TLR7, TLR8 or TLR9 receptors were used for screening inhibitors of these receptors using an inducible...
Ligand InfoPC cidPC sid
In DepthDetails US Patent
TargetToll-like receptor 8(Homo sapiens (Human))
Bristol-Myers Squibb
US Patent
LigandPNGBDBM427565(1-(4-(2-(7,8-dimethyl-[1,2,4]triazolo[1,5-a]pyridi...)
Affinity DataIC50:  1.30nM. Assay description: HEK-Blue-cells (Invivogen) overexpressing human TLR7, TLR8 or TLR9 receptors were used for screening inhibitors of these receptors using an inducible...
Ligand InfoPC cidPC sid
In DepthDetails US Patent
TargetToll-like receptor 9(Homo sapiens (Human))
Bristol-Myers Squibb
US Patent
LigandPNGBDBM427565(1-(4-(2-(7,8-dimethyl-[1,2,4]triazolo[1,5-a]pyridi...)
Affinity DataIC50:  7.13E+3nM. Assay description: HEK-Blue-cells (Invivogen) overexpressing human TLR7, TLR8 or TLR9 receptors were used for screening inhibitors of these receptors using an inducible...
Ligand InfoPC cidPC sid
In DepthDetails US Patent
TargetToll-like receptor 7(Homo sapiens (Human))
Bristol-Myers Squibb
US Patent
LigandPNGBDBM427565(1-(4-(2-(7,8-dimethyl-[1,2,4]triazolo[1,5-a]pyridi...)
Affinity DataIC50:  0.970nM. Assay description: HEK-Blue-cells (Invivogen) overexpressing human TLR7, TLR8 or TLR9 receptors were used for screening inhibitors of these receptors using an inducible...
Ligand InfoPC cidPC sid
In DepthDetails US Patent
TargetToll-like receptor 8(Homo sapiens (Human))
Bristol-Myers Squibb
US Patent
LigandPNGBDBM427565(1-(4-(2-(7,8-dimethyl-[1,2,4]triazolo[1,5-a]pyridi...)
Affinity DataIC50:  1.5nM. Assay description: HEK-Blue-cells (Invivogen) overexpressing human TLR7, TLR8 or TLR9 receptors were used for screening inhibitors of these receptors using an inducible...
Ligand InfoPC cidPC sid
In DepthDetails US Patent
TargetToll-like receptor 9(Homo sapiens (Human))
Bristol-Myers Squibb
US Patent
LigandPNGBDBM427565(1-(4-(2-(7,8-dimethyl-[1,2,4]triazolo[1,5-a]pyridi...)
Affinity DataIC50:  7.31E+3nM. Assay description: HEK-Blue-cells (Invivogen) overexpressing human TLR7, TLR8 or TLR9 receptors were used for screening inhibitors of these receptors using an inducible...
Ligand InfoPC cidPC sid
In DepthDetails US Patent
TargetToll-like receptor 7(Homo sapiens (Human))
Bristol-Myers Squibb
US Patent
LigandPNGBDBM427565(1-(4-(2-(7,8-dimethyl-[1,2,4]triazolo[1,5-a]pyridi...)
Affinity DataIC50:  1.20nM. Assay description: HEK-Blue-cells (Invivogen) overexpressing human TLR7, TLR8 or TLR9 receptors were used for screening inhibitors of these receptors using an inducible...
Ligand InfoPC cidPC sid
In DepthDetails US Patent
TargetToll-like receptor 8(Homo sapiens (Human))
Bristol-Myers Squibb
US Patent
LigandPNGBDBM427565(1-(4-(2-(7,8-dimethyl-[1,2,4]triazolo[1,5-a]pyridi...)
Affinity DataIC50:  0.590nM. Assay description: HEK-Blue-cells (Invivogen) overexpressing human TLR7, TLR8 or TLR9 receptors were used for screening inhibitors of these receptors using an inducible...
Ligand InfoPC cidPC sid
In DepthDetails US Patent
TargetToll-like receptor 9(Homo sapiens (Human))
Bristol-Myers Squibb
US Patent
LigandPNGBDBM427565(1-(4-(2-(7,8-dimethyl-[1,2,4]triazolo[1,5-a]pyridi...)
Affinity DataIC50:  1.22E+4nM. Assay description: HEK-Blue-cells (Invivogen) overexpressing human TLR7, TLR8 or TLR9 receptors were used for screening inhibitors of these receptors using an inducible...
Ligand InfoPC cidPC sid
In DepthDetails US Patent
TargetToll-like receptor 7(Homo sapiens (Human))
Bristol-Myers Squibb
US Patent
LigandPNGBDBM427565(1-(4-(2-(7,8-dimethyl-[1,2,4]triazolo[1,5-a]pyridi...)
Affinity DataIC50:  1.5nM. Assay description: HEK-Blue-cells (Invivogen) overexpressing human TLR7, TLR8 or TLR9 receptors were used for screening inhibitors of these receptors using an inducible...
Ligand InfoPC cidPC sid
In DepthDetails US Patent
TargetToll-like receptor 8(Homo sapiens (Human))
Bristol-Myers Squibb
US Patent
LigandPNGBDBM427565(1-(4-(2-(7,8-dimethyl-[1,2,4]triazolo[1,5-a]pyridi...)
Affinity DataIC50:  0.760nM. Assay description: HEK-Blue-cells (Invivogen) overexpressing human TLR7, TLR8 or TLR9 receptors were used for screening inhibitors of these receptors using an inducible...
Ligand InfoPC cidPC sid
In DepthDetails US Patent
TargetToll-like receptor 9(Homo sapiens (Human))
Bristol-Myers Squibb
US Patent
LigandPNGBDBM427565(1-(4-(2-(7,8-dimethyl-[1,2,4]triazolo[1,5-a]pyridi...)
Affinity DataIC50:  9.84E+3nM. Assay description: HEK-Blue-cells (Invivogen) overexpressing human TLR7, TLR8 or TLR9 receptors were used for screening inhibitors of these receptors using an inducible...
Ligand InfoPC cidPC sid
In DepthDetails US Patent
TargetToll-like receptor 7(Homo sapiens (Human))
Bristol-Myers Squibb
US Patent
LigandPNGBDBM427565(1-(4-(2-(7,8-dimethyl-[1,2,4]triazolo[1,5-a]pyridi...)
Affinity DataIC50:  1.80nM. Assay description: HEK-Blue-cells (Invivogen) overexpressing human TLR7, TLR8 or TLR9 receptors were used for screening inhibitors of these receptors using an inducible...
Ligand InfoPC cidPC sid
In DepthDetails US Patent
TargetToll-like receptor 8(Homo sapiens (Human))
Bristol-Myers Squibb
US Patent
LigandPNGBDBM427565(1-(4-(2-(7,8-dimethyl-[1,2,4]triazolo[1,5-a]pyridi...)
Affinity DataIC50:  1.40nM. Assay description: HEK-Blue-cells (Invivogen) overexpressing human TLR7, TLR8 or TLR9 receptors were used for screening inhibitors of these receptors using an inducible...
Ligand InfoPC cidPC sid
In DepthDetails US Patent
TargetToll-like receptor 9(Homo sapiens (Human))
Bristol-Myers Squibb
US Patent
LigandPNGBDBM427565(1-(4-(2-(7,8-dimethyl-[1,2,4]triazolo[1,5-a]pyridi...)
Affinity DataIC50:  1.47E+4nM. Assay description: HEK-Blue-cells (Invivogen) overexpressing human TLR7, TLR8 or TLR9 receptors were used for screening inhibitors of these receptors using an inducible...
Ligand InfoPC cidPC sid
In DepthDetails US Patent
TargetToll-like receptor 7(Homo sapiens (Human))
Bristol-Myers Squibb
US Patent
LigandPNGBDBM427565(1-(4-(2-(7,8-dimethyl-[1,2,4]triazolo[1,5-a]pyridi...)
Affinity DataIC50:  0.640nM. Assay description: HEK-Blue-cells (Invivogen) overexpressing human TLR7, TLR8 or TLR9 receptors were used for screening inhibitors of these receptors using an inducible...
Ligand InfoPC cidPC sid
In DepthDetails US Patent
TargetToll-like receptor 8(Homo sapiens (Human))
Bristol-Myers Squibb
US Patent
LigandPNGBDBM427565(1-(4-(2-(7,8-dimethyl-[1,2,4]triazolo[1,5-a]pyridi...)
Affinity DataIC50:  0.930nM. Assay description: HEK-Blue-cells (Invivogen) overexpressing human TLR7, TLR8 or TLR9 receptors were used for screening inhibitors of these receptors using an inducible...
Ligand InfoPC cidPC sid
In DepthDetails US Patent
TargetToll-like receptor 9(Homo sapiens (Human))
Bristol-Myers Squibb
US Patent
LigandPNGBDBM427565(1-(4-(2-(7,8-dimethyl-[1,2,4]triazolo[1,5-a]pyridi...)
Affinity DataIC50:  1.80E+4nM. Assay description: HEK-Blue-cells (Invivogen) overexpressing human TLR7, TLR8 or TLR9 receptors were used for screening inhibitors of these receptors using an inducible...
Ligand InfoPC cidPC sid
In DepthDetails US Patent
TargetToll-like receptor 7(Homo sapiens (Human))
Bristol-Myers Squibb
US Patent
LigandPNGBDBM427565(1-(4-(2-(7,8-dimethyl-[1,2,4]triazolo[1,5-a]pyridi...)
Affinity DataIC50:  0.930nM. Assay description: HEK-Blue-cells (Invivogen) overexpressing human TLR7, TLR8 or TLR9 receptors were used for screening inhibitors of these receptors using an inducible...
Ligand InfoPC cidPC sid
In DepthDetails US Patent
TargetToll-like receptor 8(Homo sapiens (Human))
Bristol-Myers Squibb
US Patent
LigandPNGBDBM427565(1-(4-(2-(7,8-dimethyl-[1,2,4]triazolo[1,5-a]pyridi...)
Affinity DataIC50:  1.10nM. Assay description: HEK-Blue-cells (Invivogen) overexpressing human TLR7, TLR8 or TLR9 receptors were used for screening inhibitors of these receptors using an inducible...
Ligand InfoPC cidPC sid
In DepthDetails US Patent
TargetToll-like receptor 9(Homo sapiens (Human))
Bristol-Myers Squibb
US Patent
LigandPNGBDBM427565(1-(4-(2-(7,8-dimethyl-[1,2,4]triazolo[1,5-a]pyridi...)
Affinity DataIC50:  8.54E+3nM. Assay description: HEK-Blue-cells (Invivogen) overexpressing human TLR7, TLR8 or TLR9 receptors were used for screening inhibitors of these receptors using an inducible...
Ligand InfoPC cidPC sid
In DepthDetails US Patent
TargetToll-like receptor 7(Homo sapiens (Human))
Bristol-Myers Squibb
US Patent
LigandPNGBDBM427565(1-(4-(2-(7,8-dimethyl-[1,2,4]triazolo[1,5-a]pyridi...)
Affinity DataIC50:  1.5nM. Assay description: HEK-Blue™-cells (Invivogen) overexpressing human TLR7, TLR8 or TLR9 receptors were used for screening inhibitors of these receptors using an inducibl...
Ligand InfoPC cidPC sid
In DepthDetails US Patent
TargetToll-like receptor 8(Homo sapiens (Human))
Bristol-Myers Squibb
US Patent
LigandPNGBDBM427565(1-(4-(2-(7,8-dimethyl-[1,2,4]triazolo[1,5-a]pyridi...)
Affinity DataIC50:  2.30nM. Assay description: HEK-Blue™-cells (Invivogen) overexpressing human TLR7, TLR8 or TLR9 receptors were used for screening inhibitors of these receptors using an inducibl...
Ligand InfoPC cidPC sid
In DepthDetails US Patent
Displayed 1 to 50 (of 72 total ) | Next | Last >>