BDBM4282 2-(1H-indol-5-ylmethylidene)propanedinitrile::Tyrphostin deriv. 13
SMILES N#CC(=Cc1ccc2[nH]ccc2c1)C#N
InChI Key InChIKey=WXKRFPWLMFBHAV-UHFFFAOYSA-N
Data  1 IC50
  Tab Delimited (TSV)   2D SDfile   Computed 3D by Vconf -m prep SDfile
Find this compound or compounds like it in BindingDB:
Activity Spreadsheet -- Enzyme Inhibition Constant Data from BindingDB
Found 1 hit for monomerid = 4282
TargetEpidermal growth factor receptor(Homo sapiens (Human))
Hebrew University Of Jerusalem
LigandPNGBDBM4282(2-(1H-indol-5-ylmethylidene)propanedinitrile | Tyr...)
Affinity DataIC50:  2.20E+6nMpH: 7.6 T: 2°C. Assay description: The activity of EGFR, preactivated with EGF, is measured by its ability to transfer terminal phosphate from [gamma-32P]ATP to poly(GAT) substrate.
Ligand InfoPC cidPC sid
In DepthDetails ArticlePubMed