BDBM428391 US10544143, Example 827::US10730877, Example 827::US11053244, Example 827
SMILES CC(C)NCC(=O)N1CCN([C@@H](C)C1)c1ccc2[nH]c(c(C(C)C)c2n1)-c1cn2ncnc2c(C)c1C
InChI Key
Data  9 IC50
  Tab Delimited (TSV)   2D SDfile   Computed 3D by Vconf -m prep SDfile
Find this compound or compounds like it in BindingDB:
Activity Spreadsheet -- Enzyme Inhibition Constant Data from BindingDB
Found 9 hits for monomerid = 428391
TargetToll-like receptor 7(Homo sapiens (Human))
Bristol-Myers Squibb
US Patent
LigandPNGBDBM428391(US10544143, Example 827 | US10730877, Example 827 ...)
Affinity DataIC50:  0.460nM. Assay description: HEK-Blue-cells (Invivogen) overexpressing human TLR7, TLR8 or TLR9 receptors were used for screening inhibitors of these receptors using an inducible...
Ligand InfoPC cidPC sid
In DepthDetails US Patent
TargetToll-like receptor 8(Homo sapiens (Human))
Bristol-Myers Squibb
US Patent
LigandPNGBDBM428391(US10544143, Example 827 | US10730877, Example 827 ...)
Affinity DataIC50:  0.340nM. Assay description: HEK-Blue-cells (Invivogen) overexpressing human TLR7, TLR8 or TLR9 receptors were used for screening inhibitors of these receptors using an inducible...
Ligand InfoPC cidPC sid
In DepthDetails US Patent
TargetToll-like receptor 9(Homo sapiens (Human))
Bristol-Myers Squibb
US Patent
LigandPNGBDBM428391(US10544143, Example 827 | US10730877, Example 827 ...)
Affinity DataIC50:  4.85E+3nM. Assay description: HEK-Blue-cells (Invivogen) overexpressing human TLR7, TLR8 or TLR9 receptors were used for screening inhibitors of these receptors using an inducible...
Ligand InfoPC cidPC sid
In DepthDetails US Patent
TargetToll-like receptor 7(Homo sapiens (Human))
Bristol-Myers Squibb
US Patent
LigandPNGBDBM428391(US10544143, Example 827 | US10730877, Example 827 ...)
Affinity DataIC50:  0.460nM. Assay description: HEK-Blue-cells (Invivogen) overexpressing human TLR7, TLR8 or TLR9 receptors were used for screening inhibitors of these receptors using an inducible...
Ligand InfoPC cidPC sid
In DepthDetails US Patent
TargetToll-like receptor 9(Homo sapiens (Human))
Bristol-Myers Squibb
US Patent
LigandPNGBDBM428391(US10544143, Example 827 | US10730877, Example 827 ...)
Affinity DataIC50:  4.85E+3nM. Assay description: HEK-Blue™-cells (Invivogen) overexpressing human TLR7, TLR8 or TLR9 receptors were used for screening inhibitors of these receptors using an inducibl...
Ligand InfoPC cidPC sid
In DepthDetails US Patent
TargetToll-like receptor 9(Homo sapiens (Human))
Bristol-Myers Squibb
US Patent
LigandPNGBDBM428391(US10544143, Example 827 | US10730877, Example 827 ...)
Affinity DataIC50:  4.85E+3nM. Assay description: HEK-Blue-cells (Invivogen) overexpressing human TLR7, TLR8 or TLR9 receptors were used for screening inhibitors of these receptors using an inducible...
Ligand InfoPC cidPC sid
In DepthDetails US Patent
TargetToll-like receptor 7(Homo sapiens (Human))
Bristol-Myers Squibb
US Patent
LigandPNGBDBM428391(US10544143, Example 827 | US10730877, Example 827 ...)
Affinity DataIC50:  0.460nM. Assay description: HEK-Blue™-cells (Invivogen) overexpressing human TLR7, TLR8 or TLR9 receptors were used for screening inhibitors of these receptors using an inducibl...
Ligand InfoPC cidPC sid
In DepthDetails US Patent
TargetToll-like receptor 8(Homo sapiens (Human))
Bristol-Myers Squibb
US Patent
LigandPNGBDBM428391(US10544143, Example 827 | US10730877, Example 827 ...)
Affinity DataIC50:  0.340nM. Assay description: HEK-Blue™-cells (Invivogen) overexpressing human TLR7, TLR8 or TLR9 receptors were used for screening inhibitors of these receptors using an inducibl...
Ligand InfoPC cidPC sid
In DepthDetails US Patent
TargetToll-like receptor 8(Homo sapiens (Human))
Bristol-Myers Squibb
US Patent
LigandPNGBDBM428391(US10544143, Example 827 | US10730877, Example 827 ...)
Affinity DataIC50:  0.340nM. Assay description: HEK-Blue-cells (Invivogen) overexpressing human TLR7, TLR8 or TLR9 receptors were used for screening inhibitors of these receptors using an inducible...
Ligand InfoPC cidPC sid
In DepthDetails US Patent