BDBM429137 med.21724, Compound 10
SMILES CCCC(C(CC(C)C)C(=O)NC(CCCCNC(=O)OCc1ccccc1)C(=O)Nc1nccs1)N(O)C=O
InChI Key InChIKey=SKJLITFHSZNZMQ-UHFFFAOYSA-N
Data  1 IC50
  Tab Delimited (TSV)   2D SDfile   Computed 3D by Vconf -m prep SDfile
Find this compound or compounds like it in BindingDB:
Activity Spreadsheet -- Enzyme Inhibition Constant Data from BindingDB
Found 1 hit for monomerid = 429137
TargetAngiotensin-converting enzyme 2(Homo sapiens (Human))
University Of Bonn
LigandPNGBDBM429137(med.21724, Compound 10)
Affinity DataIC50:  1nM. Assay description: This is a review article.
Ligand InfoPC cidPC sid
In DepthDetails ArticlePubMed