BDBM429276 jm5b01461, Compound 94
SMILES CC1=CC[C@]2(C)CC[C@]3(C)C4=CC=C5C(C)=C(O)C(=O)C=C5[C@]4(C)CC[C@@]3(C)C2C1
InChI Key InChIKey=FLMDVQMCMIGPEK-VAPXRUTMSA-N
Data  1 IC50
  Tab Delimited (TSV)   2D SDfile   Computed 3D by Vconf -m prep SDfile
Find this compound or compounds like it in BindingDB:
Activity Spreadsheet -- Enzyme Inhibition Constant Data from BindingDB
Found 1 hit for monomerid = 429276
TargetReplicase polyprotein 1ab(Human SARS coronavirus (SARS-CoV) (Severe acute re...)
University Of Bonn
LigandPNGBDBM429276(jm5b01461, Compound 94)
Affinity DataIC50:  2.60E+3nM. Assay description: This is a review article.
Ligand InfoPC cidPC sid
In DepthDetails ArticlePubMed