BDBM429412 med.21724, Compound 85
SMILES O[C@H]([C@H](Cc1ccccc1)NC(=O)OCc1ccccc1)[C@H](O)[C@H](Cc1ccccc1)NC(=O)OCc1ccccc1
InChI Key InChIKey=VHZZMBIUMSGNBP-GASGPIRDSA-N
Data  1 KI
  Tab Delimited (TSV)   2D SDfile   Computed 3D by Vconf -m prep SDfile
Find this compound or compounds like it in BindingDB:
Activity Spreadsheet -- Enzyme Inhibition Constant Data from BindingDB
Found 1 hit for monomerid = 429412
TargetReplicase polyprotein 1ab(Human SARS coronavirus (SARS-CoV) (Severe acute re...)
University Of Bonn
LigandPNGBDBM429412(med.21724, Compound 85)
Affinity DataKi:  600nM. Assay description: This is a review article.
Ligand InfoPC cidPC sid
In DepthDetails ArticlePubMed