BDBM429417 acs.jmedchem.1c00409_ST.20::med.21724, Compound 90
SMILES O=C(On1nnc2ccccc12)c1ccc2[nH]cnc2c1
InChI Key InChIKey=ZVXNOBBLRBKRCE-UHFFFAOYSA-N
Data  2 KI
  Tab Delimited (TSV)   2D SDfile   Computed 3D by Vconf -m prep SDfile
Find this compound or compounds like it in BindingDB:
Activity Spreadsheet -- Enzyme Inhibition Constant Data from BindingDB
Found 2 hits for monomerid = 429417
TargetReplicase polyprotein 1ab(Human SARS coronavirus (SARS-CoV) (Severe acute re...)
Michigan State University
LigandPNGBDBM429417(acs.jmedchem.1c00409_ST.20 | med.21724, Compound 9...)
Affinity DataKi:  23nM. Assay description: This is a review article. Please point to the original journal.
Ligand InfoPC cidPC sid
In DepthDetails ArticlePubMed
TargetReplicase polyprotein 1ab(Human SARS coronavirus (SARS-CoV) (Severe acute re...)
Michigan State University
LigandPNGBDBM429417(acs.jmedchem.1c00409_ST.20 | med.21724, Compound 9...)
Affinity DataKi:  23nM. Assay description: This is a review article.
Ligand InfoPC cidPC sid
In DepthDetails ArticlePubMed