BDBM431635 US10550105, Example 553::US10870641, Example 553::US11014913, Example 553
SMILES FC(F)(F)c1cnc(nc1)N1CCN(CC1)C(=O)CCOCCOc1cn[nH]c(=O)c1C#N
InChI Key InChIKey=MDAYGLLCFCAKJK-UHFFFAOYSA-N
Data  3 IC50
  Tab Delimited (TSV)   2D SDfile   Computed 3D by Vconf -m prep SDfile
Find this compound or compounds like it in BindingDB:
Activity Spreadsheet -- Enzyme Inhibition Constant Data from BindingDB
Found 3 hits for monomerid = 431635
TargetProtein mono-ADP-ribosyltransferase TIPARP(Human)
Ribon Therapeutics
US Patent
LigandPNGBDBM431635(US10550105, Example 553 | US10870641, Example 553 ...)
Affinity DataIC50: <100nM. Assay description: Displacement of Probe A, a biotinylated probe binding to the TIPARP active site, was measured using a time-resolved fluorescence energy transfer (TR-...
Ligand InfoPC cidPC sid
In DepthDetails US Patent
TargetProtein mono-ADP-ribosyltransferase TIPARP(Human)
Ribon Therapeutics
US Patent
LigandPNGBDBM431635(US10550105, Example 553 | US10870641, Example 553 ...)
Affinity DataIC50: <100nM. Assay description: Displacement of Probe A, a biotinylated probe binding to the TIPARP active site, was measured using a time-resolved fluorescence energy transfer (TR-...
Ligand InfoPC cidPC sid
In DepthDetails US Patent
TargetProtein mono-ADP-ribosyltransferase TIPARP(Human)
Ribon Therapeutics
US Patent
LigandPNGBDBM431635(US10550105, Example 553 | US10870641, Example 553 ...)
Affinity DataIC50: <100nM. Assay description: Displacement of Probe A, a biotinylated probe binding to the TIPARP active site, was measured using a time-resolved fluorescence energy transfer (TR-...
Ligand InfoPC cidPC sid
In DepthDetails US Patent