BDBM433462 US10562850, Compound 82a::US11066360, Compound 82a
SMILES CO[C@@H]1C[C@@H](N(C1)C(=O)c1ccc2cc[nH]c2c1)C(=O)Nc1cc(ccc1F)C(N)(CCC1CC1)c1ccncc1
InChI Key InChIKey=MPOMDZOLMQUDDS-UCGPOHEZSA-N
Data  2 KI
  Tab Delimited (TSV)   2D SDfile   Computed 3D by Vconf -m prep SDfile
Find this compound or compounds like it in BindingDB:
Activity Spreadsheet -- Enzyme Inhibition Constant Data from BindingDB
Found 2 hits for monomerid = 433462
TargetPlasma kallikrein(Homo sapiens (Human))
Biocryst Pharmaceuticals
US Patent
LigandPNGBDBM433462(US10562850, Compound 82a | US11066360, Compound 82...)
Affinity DataKi: >100nM. Assay description: The effect of compounds of the invention on human plasma kallikrein activity was determined using the chromogenic substrates (DiaPharma Group, Inc., ...
Ligand InfoPC cidPC sid
In DepthDetails US Patent
TargetPlasma kallikrein(Homo sapiens (Human))
Biocryst Pharmaceuticals
US Patent
LigandPNGBDBM433462(US10562850, Compound 82a | US11066360, Compound 82...)
Affinity DataKi: >100nM. Assay description: The effect of compounds of the invention on human plasma kallikrein activity was determined using the chromogenic substrates. In these experiments, 2...
Ligand InfoPC cidPC sid
In DepthDetails US Patent