BDBM43387 (E)-5-methyl-1-(2-sulfanylidene-1,3-benzoxazol-3-yl)-1-hexen-3-one::(E)-5-methyl-1-(2-sulfanylidene-1,3-benzoxazol-3-yl)hex-1-en-3-one::(E)-5-methyl-1-(2-thioxo-1,3-benzoxazol-3-yl)hex-1-en-3-one::5-Methyl-1-(2-thioxo-benzooxazol-3-yl)-hex-1-en-3-one::MLS000557159::SMR000173965::cid_834844
SMILES CC(C)CC(=O)C=Cn1c2ccccc2oc1=S
InChI Key InChIKey=MFSKFEMERYYCSZ-UHFFFAOYSA-N
Data  3 EC50
  Tab Delimited (TSV)   2D SDfile   Computed 3D by Vconf -m prep SDfile
Find this compound or compounds like it in BindingDB:
Activity Spreadsheet -- Enzyme Inhibition Constant Data from BindingDB
Found 3 hits for monomerid = 43387
TargetE3 ubiquitin-protein ligase Mdm2(Homo sapiens (Human))
Pcmd
Curated by PubChem BioAssay
LigandPNGBDBM43387((E)-5-methyl-1-(2-sulfanylidene-1,3-benzoxazol-3-y...)
Affinity DataEC50:  1.20E+3nM. Assay description: Molecular Library Screening Center Network (MLSCN) Penn Center for Molecular Discovery (PCMD) Assay Provider: Brent Stockwell, Columbia University ML...
In DepthDetails PCBioAssay
TargetE3 ubiquitin-protein ligase Mdm2(Homo sapiens (Human))
Pcmd
Curated by PubChem BioAssay
LigandPNGBDBM43387((E)-5-methyl-1-(2-sulfanylidene-1,3-benzoxazol-3-y...)
Affinity DataEC50:  2.53E+3nM. Assay description: Molecular Library Screening Center Network (MLSCN) Penn Center for Molecular Discovery (PCMD) Assay Provider: Brent Stockwell, Columbia University ML...
In DepthDetails PCBioAssay
TargetE3 ubiquitin-protein ligase Mdm2(Homo sapiens (Human))
Pcmd
Curated by PubChem BioAssay
LigandPNGBDBM43387((E)-5-methyl-1-(2-sulfanylidene-1,3-benzoxazol-3-y...)
Affinity DataEC50:  4.79E+3nM. Assay description: Molecular Library Screening Center Network (MLSCN) Penn Center for Molecular Discovery (PCMD) Assay Provider: Brent Stockwell, Columbia University ML...
In DepthDetails PCBioAssay