BDBM434478 US10562891, Example 392::US11008308, Example 392
SMILES CC(=O)N[C@H]1CC[C@@H](CC1)SCc1nc2cc(NC3CCC3)c(F)c(F)c2c(=O)[nH]1
InChI Key
Data  2 IC50
  Tab Delimited (TSV)   2D SDfile   Computed 3D by Vconf -m prep SDfile
Find this compound or compounds like it in BindingDB:
Activity Spreadsheet -- Enzyme Inhibition Constant Data from BindingDB
Found 2 hits for monomerid = 434478
TargetProtein mono-ADP-ribosyltransferase PARP14(Homo sapiens (Human))
Ribon Therapeutics
US Patent
LigandPNGBDBM434478(US10562891, Example 392 | US11008308, Example 392)
Affinity DataIC50: <1.00E+3nM. Assay description: Enzymatic inhibition of PARP14 was measured using a dissociation-enhanced lanthanide fluorescence immunoassay (DELFIA) monitoring the auto-modificati...
Ligand InfoPC cidPC sid
In DepthDetails US Patent
TargetProtein mono-ADP-ribosyltransferase PARP14 [1611-1801](Homo sapiens (Human))
Ribon Therapeutics
US Patent
LigandPNGBDBM434478(US10562891, Example 392 | US11008308, Example 392)
Affinity DataIC50: <1.00E+3nM. Assay description: Enzymatic inhibition of PARP14 was measured using a dissociation-enhanced lanthanide fluorescence immunoassay (DELFIA) monitoring the auto-modificati...
Ligand InfoPC cidPC sid
In DepthDetails US Patent