BDBM4351 (2E)-2-cyano-3-(4-formylphenyl)prop-2-enoic acid::benzylidenemalononitrile (BMN) deriv. 35
SMILES OC(=O)C(=C\c1ccc(C=O)cc1)\C#N
InChI Key InChIKey=UJSNKTGYHDLGGE-BJMVGYQFSA-N
Data  1 KI  1 IC50
  Tab Delimited (TSV)   2D SDfile   Computed 3D by Vconf -m prep SDfile
Find this compound or compounds like it in BindingDB:
Activity Spreadsheet -- Enzyme Inhibition Constant Data from BindingDB
Found 1 hit for monomerid = 4351
TargetEpidermal growth factor receptor(Homo sapiens (Human))
Hebrew University Of Jerusalem
LigandPNGBDBM4351((2E)-2-cyano-3-(4-formylphenyl)prop-2-enoic acid |...)
Affinity DataKi:  4.70E+4nM IC50:  1.40E+5nM. Assay description: The activity of EGFR, preactivated with EGF, is measured by its ability to transfer terminal phosphate from [gamma-32P]ATP to poly(GAT) substrate.
In DepthDetails ArticlePubMed