BDBM437370 4-ethoxy-1-methyl-5-(1-(1-(3-(1-methyl-1H-pyrazol-4-yl) phenyl)ethyl)-1H-pyrazol-4-yl)pyridin-2(1H)-one::US10617680, Example 104::US11020380, Example 104
SMILES CCOc1cc(=O)n(C)cc1-c1cnn(c1)C(C)c1cccc(c1)-c1cnn(C)c1
InChI Key InChIKey=VDJIHAGVQFIIMB-UHFFFAOYSA-N
Data  2 IC50
  Tab Delimited (TSV)   2D SDfile   Computed 3D by Vconf -m prep SDfile
Find this compound or compounds like it in BindingDB:
Activity Spreadsheet -- Enzyme Inhibition Constant Data from BindingDB
Found 2 hits for monomerid = 437370
TargetCREB-binding protein(Homo sapiens (Human))
Celgene Quanticel Research
US Patent
LigandPNGBDBM437370(4-ethoxy-1-methyl-5-(1-(1-(3-(1-methyl-1H-pyrazol-...)
Affinity DataIC50: <500nM. Assay description: The CBP-inhibitory activity of the compounds described herein was determined by calculating the IC50. More specifically, CBP inhibitor activity was a...
Ligand InfoPC cidPC sid
In DepthDetails US Patent
TargetCREB-binding protein(Homo sapiens (Human))
Celgene Quanticel Research
US Patent
LigandPNGBDBM437370(4-ethoxy-1-methyl-5-(1-(1-(3-(1-methyl-1H-pyrazol-...)
Affinity DataIC50: <500nM. Assay description: The CBP-inhibitory activity of the compounds described herein was determined by calculating the IC50. More specifically, CBP inhibitor activity was a...
Ligand InfoPC cidPC sid
In DepthDetails US Patent