BDBM444416 US10662159, Example 1
SMILES FC(F)(F)C(OC(=O)N1CCc2ccccc2C1)C(F)(F)F
InChI Key InChIKey=KZMGERNGWDRNGP-UHFFFAOYSA-N
Data  4 IC50
  Tab Delimited (TSV)   2D SDfile   Computed 3D by Vconf -m prep SDfile
Find this compound or compounds like it in BindingDB:
Activity Spreadsheet -- Enzyme Inhibition Constant Data from BindingDB
Found 4 hits for monomerid = 444416
TargetMonoacylglycerol lipase ABHD6(Homo sapiens (Human))
Makscientific
US Patent
LigandPNGBDBM444416(US10662159, Example 1)
Affinity DataIC50:  55nM. Assay description: ABHD6: Certain compounds were tested for their ABHD6 and dual ABHD6/MGL inhibitory activity, which is expressed as % of inhibition or IC50 values. Th...
Ligand InfoPC cidPC sid
In DepthDetails US Patent
TargetFatty-acid amide hydrolase 1 [30-579](Rattus norvegicus (rat))
Makscientific
US Patent
LigandPNGBDBM444416(US10662159, Example 1)
Affinity DataIC50: >1.00E+3nM. Assay description: hABHD6:Initial Fluorescent Inhibition Assay (3-Point)—In each well of a 96-well plate 8 μL of membrane fraction containing full-length hABHD6 (1...
Ligand InfoPC cidPC sid
In DepthDetails US Patent
TargetFatty-acid amide hydrolase 1(Homo sapiens (Human))
Makscientific
US Patent
LigandPNGBDBM444416(US10662159, Example 1)
Affinity DataIC50: >1.00E+3nM. Assay description: Rat/homo FAAH:Procedure was followed as described for hMGL, except that arachidonoyl-methyl coumarin (was used as fluorigenic substrate. Compounds we...
Ligand InfoPC cidPC sid
In DepthDetails US Patent
TargetMonoglyceride lipase(Homo sapiens (Human))
Makscientific
US Patent
LigandPNGBDBM444416(US10662159, Example 1)
Affinity DataIC50: >1.00E+3nM. Assay description: MGL: Compound inhibition of hMGL activity was assessed by a fluorometric assay recently developed in our laboratory (Makriyannis et al WO Patent Appl...
Ligand InfoPC cidPC sid
In DepthDetails US Patent