BDBM44452 1-esyl-N-[2-(N-ethylanilino)ethyl]nipecotamide::MLS000046560::N-[2-(N-ethylanilino)ethyl]-1-ethylsulfonyl-3-piperidinecarboxamide::N-[2-(N-ethylanilino)ethyl]-1-ethylsulfonylpiperidine-3-carboxamide::N-[2-[ethyl(phenyl)amino]ethyl]-1-ethylsulfonyl-piperidine-3-carboxamide::N-{2-[ethyl(phenyl)amino]ethyl}-1-(ethylsulfonyl)piperidine-3-carboxamide::SMR000032571::cid_3245787
SMILES CCN(CCNC(=O)C1CCCN(C1)S(=O)(=O)CC)c1ccccc1
InChI Key InChIKey=FOHCEGLTKHOKRI-UHFFFAOYSA-N
Data  2 IC50
  Tab Delimited (TSV)   2D SDfile   Computed 3D by Vconf -m prep SDfile
Find this compound or compounds like it in BindingDB:
Activity Spreadsheet -- Enzyme Inhibition Constant Data from BindingDB
Found 2 hits for monomerid = 44452
TargetEphrin type-A receptor 4(Mus musculus)
Burnham Center For Chemical Genomics
Curated by PubChem BioAssay
LigandPNGBDBM44452(1-esyl-N-[2-(N-ethylanilino)ethyl]nipecotamide | M...)
Affinity DataIC50: >5.00E+4nM. Assay description: Sanford-Burnham Center for Chemical Genomics (SBCCG) Sanford-Burnham Medical Research Institute (SBMRI, San Diego, CA) NIH Molecular Libraries Screen...
In DepthDetails PCBioAssay
TargetEphrin type-A receptor 4(Mus musculus)
Burnham Center For Chemical Genomics
Curated by PubChem BioAssay
LigandPNGBDBM44452(1-esyl-N-[2-(N-ethylanilino)ethyl]nipecotamide | M...)
Affinity DataIC50: >1.00E+5nM. Assay description: Data Source: Sanford-Burnham Center for Chemical Genomics (SBCCG) Source Affiliation: Sanford-Burnham Medical Research Institute (SBMRI, San Diego, C...
In DepthDetails PCBioAssay