BDBM44661 2-ethyl-5-(3-fluorophenyl)-3-keto-7-methyl-5H-thiazolo[3,2-a]pyrimidine-6-carboxylic acid ethyl ester::2-ethyl-5-(3-fluorophenyl)-7-methyl-3-oxo-5H-thiazolo[3,2-a]pyrimidine-6-carboxylic acid ethyl ester::MLS000043549::SMR000020366::cid_3244068::ethyl 2-ethyl-5-(3-fluorophenyl)-7-methyl-3-oxidanylidene-5H-[1,3]thiazolo[3,2-a]pyrimidine-6-carboxylate::ethyl 2-ethyl-5-(3-fluorophenyl)-7-methyl-3-oxo-2,3-dihydro-5H-[1,3]thiazolo[3,2-a]pyrimidine-6-carboxylate::ethyl 2-ethyl-5-(3-fluorophenyl)-7-methyl-3-oxo-5H-[1,3]thiazolo[3,2-a]pyrimidine-6-carboxylate
SMILES CCOC(=O)C1=C(C)N=C2SC(CC)C(=O)N2C1c1cccc(F)c1
InChI Key InChIKey=LYNAODSMKSPYCB-UHFFFAOYSA-N
Data  1 EC50
  Tab Delimited (TSV)   2D SDfile   Computed 3D by Vconf -m prep SDfile
Find this compound or compounds like it in BindingDB:
Activity Spreadsheet -- Enzyme Inhibition Constant Data from BindingDB
Found 1 hit for monomerid = 44661
TargetMultidrug resistance-associated protein 1(Homo sapiens (Human))
Srmlsc
Curated by PubChem BioAssay
LigandPNGBDBM44661(2-ethyl-5-(3-fluorophenyl)-3-keto-7-methyl-5H-thia...)
Affinity DataEC50:  6.14E+3nM. Assay description: Southern Research Molecular Libraries Screening Center (SRMLSC) Southern Research Institute (Birmingham, Alabama) NIH Molecular Libraries Screening C...
In DepthDetails PCBioAssay