BDBM448659 3-(7-(difluoromethyl)-6-(1-methyl-1H-pyrazol-4-yl)-3,4-dihydroquinolin-1(2H)-yl)-N-methyl-1-(tetrahydro-2H-pyran-4-yl)-1H-pyrazolo[4,3-b]pyridine-5-carboxamide::US10696655, Example 125::US11168070, Example 125
SMILES CNC(=O)c1ccc2n(nc(N3CCCc4cc(-c5cnn(C)c5)c(cc34)C(F)F)c2n1)C1CCOCC1
InChI Key InChIKey=YLVCOGZGKINOTK-UHFFFAOYSA-N
Data  2 IC50
  Tab Delimited (TSV)   2D SDfile   Computed 3D by Vconf -m prep SDfile
Find this compound or compounds like it in BindingDB:
Activity Spreadsheet -- Enzyme Inhibition Constant Data from BindingDB
Found 2 hits for monomerid = 448659
TargetCREB-binding protein(Homo sapiens (Human))
Genentech
US Patent
LigandPNGBDBM448659(3-(7-(difluoromethyl)-6-(1-methyl-1H-pyrazol-4-yl)...)
Affinity DataIC50:  2nM. Assay description: His/Flag epitope tagged CBP was cloned, expressed, and purified to homogeneity. CBP binding and inhibition was assessed by monitoring the engagement ...
Ligand InfoPC cidPC sid
In DepthDetails US Patent
TargetCREB-binding protein(Homo sapiens (Human))
Genentech
US Patent
LigandPNGBDBM448659(3-(7-(difluoromethyl)-6-(1-methyl-1H-pyrazol-4-yl)...)
Affinity DataIC50:  2nM. Assay description: His/Flag epitope tagged CBP was cloned, expressed, and purified to homogeneity. CBP binding and inhibition was assessed by monitoring the engagement ...
Ligand InfoPC cidPC sid
In DepthDetails US Patent