BDBM448718 US10696661, Compound 65
SMILES FC(F)(F)c1ccc(N2CCN(Cc3cnoc3)CC2)c(NC(=O)c2ccc(o2)C2CCOCC2)c1
InChI Key InChIKey=RJNLMPYEONUGOY-UHFFFAOYSA-N
Data  1 IC50
  Tab Delimited (TSV)   2D SDfile   Computed 3D by Vconf -m prep SDfile
Find this compound or compounds like it in BindingDB:
Activity Spreadsheet -- Enzyme Inhibition Constant Data from BindingDB
Found 1 hit for monomerid = 448718
TargetSRSF protein kinase 1(Homo sapiens (Human))
Exonate
US Patent
LigandPNGBDBM448718(US10696661, Compound 65)
Affinity DataIC50:  9.70nM. Assay description: Screening of a series of molecules identified compounds (Compounds 5, 8, 16 to 18 and 43 of Table 3) that had improved potency against SRPK1 against ...
Ligand InfoPC cidPC sid
In DepthDetails US Patent