BDBM45056 7-(difluoromethyl)-3-[(2-ethyl-1H-imidazol-1-yl)carbonyl]-5-(4-methylphenyl)pyrazolo[1,5-a]pyrimidine::MLS000579609::SMR000199047::[7-(difluoromethyl)-5-(4-methylphenyl)-3-pyrazolo[1,5-a]pyrimidinyl]-(2-ethyl-1-imidazolyl)methanone::[7-(difluoromethyl)-5-(4-methylphenyl)pyrazolo[1,5-a]pyrimidin-3-yl]-(2-ethylimidazol-1-yl)methanone::[7-(difluoromethyl)-5-(p-tolyl)pyrazolo[1,5-a]pyrimidin-3-yl]-(2-ethylimidazol-1-yl)methanone::[7-[bis(fluoranyl)methyl]-5-(4-methylphenyl)pyrazolo[1,5-a]pyrimidin-3-yl]-(2-ethylimidazol-1-yl)methanone::cid_1289753
SMILES CCc1nccn1C(=O)c1cnn2c(cc(nc12)-c1ccc(C)cc1)C(F)F
InChI Key InChIKey=QHIRBQMBSUOCAG-UHFFFAOYSA-N
Data  1 IC50  1 EC50
  Tab Delimited (TSV)   2D SDfile   Computed 3D by Vconf -m prep SDfile
Find this compound or compounds like it in BindingDB:
Activity Spreadsheet -- Enzyme Inhibition Constant Data from BindingDB
Found 2 hits for monomerid = 45056
TargetMitochondrial peptide methionine sulfoxide reductase(Bos taurus)
The Scripps Research Institute Molecular Screening Center
Curated by PubChem BioAssay
LigandPNGBDBM45056(7-(difluoromethyl)-3-[(2-ethyl-1H-imidazol-1-yl)ca...)
Affinity DataIC50: >1.55E+5nM
In DepthDetails PCBioAssay
TargetMultidrug resistance-associated protein 1(Homo sapiens (Human))
Srmlsc
Curated by PubChem BioAssay
LigandPNGBDBM45056(7-(difluoromethyl)-3-[(2-ethyl-1H-imidazol-1-yl)ca...)
Affinity DataEC50:  523nM. Assay description: Southern Research Molecular Libraries Screening Center (SRMLSC) Southern Research Institute (Birmingham, Alabama) NIH Molecular Libraries Screening C...
In DepthDetails PCBioAssay