BDBM4663 4-Anilinoquinazoline 10::N-(4-Chloro-2-fluorophenyl)-6-methoxy-7-{[(2E)-4-pyrrolidin-1-ylbut-2-enyl]oxy}quinazolin-4-amine::N-(4-chloro-2-fluorophenyl)-6-methoxy-7-{[(2E)-4-(pyrrolidin-1-yl)but-2-en-1-yl]oxy}quinazolin-4-amine
SMILES COc1cc2c(Nc3ccc(Cl)cc3F)ncnc2cc1OC\C=C\CN1CCCC1
InChI Key InChIKey=BMEKKWWFQMYXPU-SNAWJCMRSA-N
Data  4 IC50
  Tab Delimited (TSV)   2D SDfile   Computed 3D by Vconf -m prep SDfile
Find this compound or compounds like it in BindingDB:
Activity Spreadsheet -- Enzyme Inhibition Constant Data from BindingDB
Found 4 hits for monomerid = 4663
TargetVascular endothelial growth factor receptor 1(Homo sapiens (Human))
Astrazeneca
LigandPNGBDBM4663(4-Anilinoquinazoline 10 | N-(4-Chloro-2-fluorophen...)
Affinity DataIC50:  750nMpH: 7.4 T: 2°C. Assay description: An ELISA assay was used to determine the ability of inhibitor to inhibit VEGF-R RTK activity. The compounds were incubated with enzyme 20 min at room...
In DepthDetails ArticlePubMed
TargetEpidermal growth factor receptor(Homo sapiens (Human))
Astrazeneca
LigandPNGBDBM4663(4-Anilinoquinazoline 10 | N-(4-Chloro-2-fluorophen...)
Affinity DataIC50:  90nMT: 2°C. Assay description: An ELISA assay was used to determine the ability of inhibitor to inhibit EGF-R RTK activity. The compounds were incubated with enzyme 20 min at room ...
In DepthDetails ArticlePubMed
TargetFibroblast growth factor receptor 1(Homo sapiens (Human))
Astrazeneca
LigandPNGBDBM4663(4-Anilinoquinazoline 10 | N-(4-Chloro-2-fluorophen...)
Affinity DataIC50:  1.90E+3nMT: 2°C. Assay description: An ELISA assay was used to determine the ability of inhibitor to inhibit FGFR-1 TK activity. The compounds were incubated with enzyme 20 min at room ...
In DepthDetails ArticlePubMed
TargetVascular endothelial growth factor receptor 2(Homo sapiens (Human))
Astrazeneca
LigandPNGBDBM4663(4-Anilinoquinazoline 10 | N-(4-Chloro-2-fluorophen...)
Affinity DataIC50:  40nMT: 2°C. Assay description: An ELISA assay was used to determine the ability of inhibitor to inhibit VEGF-R RTK activity. The compounds were incubated with enzyme 20 min at room...
In DepthDetails ArticlePubMed