BDBM466569 US10800755, Example 23::US11014905, Example 25
SMILES FC(F)(F)c1cccc(n1)C1CCN(CCNC(=O)C2CCOC2)CC1
InChI Key InChIKey=GGSIQDWKWRXJBY-UHFFFAOYSA-N
Data  6 KI  3 IC50  2 EC50
  Tab Delimited (TSV)   2D SDfile   Computed 3D by Vconf -m prep SDfile
Find this compound or compounds like it in BindingDB:
Activity Spreadsheet -- Enzyme Inhibition Constant Data from BindingDB
Found 11 hits for monomerid = 466569
TargetD(2) dopamine receptor(Homo sapiens (Human))
Sumitomo Dainippon Pharma
US Patent
LigandPNGBDBM466569(US10800755, Example 23 | US11014905, Example 25)
Affinity DataKi:  20nM. Assay description: The binding affinity of the present compounds to human 5-HT1A receptor, human D4 receptor, and human D2 receptor was measured in a manner mentioned b...
Ligand InfoPC cidPC sid
In DepthDetails US Patent
TargetD(2) dopamine receptor(Homo sapiens (Human))
Sumitomo Dainippon Pharma
US Patent
LigandPNGBDBM466569(US10800755, Example 23 | US11014905, Example 25)
Affinity DataKi:  166nM. Assay description: The binding affinity of the present compounds to human 5-HT1A receptor, human D4 receptor, and human D2 receptor was measured in a manner mentioned b...
Ligand InfoPC cidPC sid
In DepthDetails US Patent
TargetD(4) dopamine receptor(Homo sapiens (Human))
Sumitomo Dainippon Pharma
US Patent
LigandPNGBDBM466569(US10800755, Example 23 | US11014905, Example 25)
Affinity DataKi:  408nM. Assay description: The binding affinity of the present compounds to human 5-HT1A receptor, human D4 receptor, and human D2 receptor was measured in a manner mentioned b...
Ligand InfoPC cidPC sid
In DepthDetails US Patent
TargetD(4) dopamine receptor(Homo sapiens (Human))
Sumitomo Dainippon Pharma
US Patent
LigandPNGBDBM466569(US10800755, Example 23 | US11014905, Example 25)
Affinity DataKi:  423nM. Assay description: The binding affinity of the present compounds to human 5-HT1A receptor, human D4 receptor, and human D2 receptor was measured in a manner mentioned b...
Ligand InfoPC cidPC sid
In DepthDetails US Patent
Target5-hydroxytryptamine receptor 1A(Homo sapiens (Human))
Sumitomo Dainippon Pharma
US Patent
LigandPNGBDBM466569(US10800755, Example 23 | US11014905, Example 25)
Affinity DataKi:  3.33E+3nM. Assay description: The binding affinity of the present compounds to human 5-HT1A receptor, human D4 receptor, and human D2 receptor was measured in a manner mentioned b...
Ligand InfoPC cidPC sid
In DepthDetails US Patent
Target5-hydroxytryptamine receptor 1A(Homo sapiens (Human))
Sumitomo Dainippon Pharma
US Patent
LigandPNGBDBM466569(US10800755, Example 23 | US11014905, Example 25)
Affinity DataKi: >1.00E+4nM. Assay description: The binding affinity of the present compounds to human 5-HT1A receptor, human D4 receptor, and human D2 receptor was measured in a manner mentioned b...
Ligand InfoPC cidPC sid
In DepthDetails US Patent
Target5-hydroxytryptamine receptor 1A(Homo sapiens (Human))
Sumitomo Dainippon Pharma
US Patent
LigandPNGBDBM466569(US10800755, Example 23 | US11014905, Example 25)
Affinity DataEC50:  632nM. Assay description: Aequorin, Gα16 proteins, and each receptor were transiently expressed in CHO-K1 cell (Chinese hamster ovary), and seeded to 384-well plate. The ...
Ligand InfoPC cidPC sid
In DepthDetails US Patent
TargetD(4) dopamine receptor(Homo sapiens (Human))
Sumitomo Dainippon Pharma
US Patent
LigandPNGBDBM466569(US10800755, Example 23 | US11014905, Example 25)
Affinity DataEC50:  62nM. Assay description: Aequorin, Gα16 proteins, and each receptor were transiently expressed in CHO-K1 cell (Chinese hamster ovary), and seeded to 384-well plate. The ...
Ligand InfoPC cidPC sid
In DepthDetails US Patent
TargetD(4) dopamine receptor(Homo sapiens (Human))
Sumitomo Dainippon Pharma
US Patent
LigandPNGBDBM466569(US10800755, Example 23 | US11014905, Example 25)
Affinity DataIC50:  408nM. Assay description: The binding affinity of the present compounds to human 5-HT1A receptor, human D4 receptor, and human D2 receptor was measured in a manner mentioned b...
Ligand InfoPC cidPC sid
In DepthDetails US Patent
Target5-hydroxytryptamine receptor 1A(Homo sapiens (Human))
Sumitomo Dainippon Pharma
US Patent
LigandPNGBDBM466569(US10800755, Example 23 | US11014905, Example 25)
Affinity DataIC50:  166nM. Assay description: The binding affinity of the present compounds to human 5-HT1A receptor, human D4 receptor, and human D2 receptor was measured in a manner mentioned b...
Ligand InfoPC cidPC sid
In DepthDetails US Patent
TargetD(2) dopamine receptor(Homo sapiens (Human))
Sumitomo Dainippon Pharma
US Patent
LigandPNGBDBM466569(US10800755, Example 23 | US11014905, Example 25)
Affinity DataIC50: >1.00E+4nM. Assay description: The binding affinity of the present compounds to human 5-HT1A receptor, human D4 receptor, and human D2 receptor was measured in a manner mentioned b...
Ligand InfoPC cidPC sid
In DepthDetails US Patent