BDBM46665 4-[(4-methylbenzylidene)amino]-3-(4-pyridyl)-1H-1,2,4-triazole-5-thione::4-[(4-methylphenyl)methylideneamino]-3-pyridin-4-yl-1H-1,2,4-triazole-5-thione::MLS-0225315.0001::cid_950159
SMILES Cc1ccc(C=Nn2c(n[nH]c2=S)-c2ccncc2)cc1
InChI Key InChIKey=SNBBGQVXDNUNDG-UHFFFAOYSA-N
Data  3 IC50
  Tab Delimited (TSV)   2D SDfile   Computed 3D by Vconf -m prep SDfile
Find this compound or compounds like it in BindingDB:
Activity Spreadsheet -- Enzyme Inhibition Constant Data from BindingDB
Found 3 hits for monomerid = 46665
TargetPhosphomannomutase 2(Homo sapiens (Human))
Burnham Center For Chemical Genomics
Curated by PubChem BioAssay
LigandPNGBDBM46665(4-[(4-methylbenzylidene)amino]-3-(4-pyridyl)-1H-1,...)
Affinity DataIC50: >1.00E+5nM. Assay description: Data Source: Sanford-Burnham Center for Chemical Genomics (SBCCG) Source Affiliation: Sanford-Burnham Medical Research Institute (SBMRI, San Diego, C...
In DepthDetails PCBioAssay
TargetMannose-6-phosphate isomerase(Homo sapiens (Human))
Sanford-Burnham Center For Chemical Genomics
Curated by PubChem BioAssay
LigandPNGBDBM46665(4-[(4-methylbenzylidene)amino]-3-(4-pyridyl)-1H-1,...)
Affinity DataIC50:  1.83E+4nM. Assay description: Data Source: Sanford-Burnham Center for Chemical Genomics (SBCCG) Source Affiliation: Sanford-Burnham Medical Research Institute (SBMRI, San Diego, C...
In DepthDetails PCBioAssay
TargetMannose-6-phosphate isomerase(Homo sapiens (Human))
Sanford-Burnham Center For Chemical Genomics
Curated by PubChem BioAssay
LigandPNGBDBM46665(4-[(4-methylbenzylidene)amino]-3-(4-pyridyl)-1H-1,...)
Affinity DataIC50:  1.61E+4nM. Assay description: Data Source: Sanford-Burnham Center for Chemical Genomics (SBCCG) Source Affiliation: Sanford-Burnham Medical Research Institute (SBMRI, San Diego, C...
In DepthDetails PCBioAssay